program: Gaussian 09
title: 000071181
version: EM64L-G09RevD.01
frameworkgroup: C1[X(H3O4P)]
method: RPBEPBE
basis: SDD
operation: Freq
keyword: #p
keyword: freq=noraman
keyword: PBEPBE/SDD
title: #p freq=noraman PBEPBE/SDD
converged: YES YES NO NO
title: Mulliken charges:
elementType: P O O O O H H H
charge: 1.397519 -0.665143 -0.704111 -0.670088 -0.580525 0.413195 0.408490 0.400663
chargesum: 0.00000
title: Mulliken charges with hydrogens summed into heavy atoms:
elementType: P O O O O
charge: 1.397519 -0.251947 -0.295621 -0.269425 -0.580525
polarizability: 3.95799354e+01 -2.25137647e+00 3.52604611e+01 8.32634768e-01 2.57127402e-01 3.20821990e+01
1716.lowfreq: -14.1243 -0.0026 -0.0024 -0.0023 1.6611 4.2883 171.1842 190.0267 263.3487
frequency: 171.1798 190.0252 263.3432 293.6872 339.3934 340.6887 353.9082 385.3918 646.7305 734.4482 759.4231 978.3150 1007.9554 1019.7694 1127.4661 3584.0908 3599.2720 3625.7529
redmass: 1.8773 1.6698 1.4619 2.0791 3.9243 3.7584 3.9488 2.7636 13.1091 9.1209 8.6022 1.4418 1.2881 1.2247 3.4824 1.0659 1.0664 1.0667
irintensity: 163.9816 43.7343 38.7299 29.3488 7.5538 61.1826 93.1278 177.9481 43.0440 264.1896 263.3902 91.0503 22.7481 86.0846 160.8920 79.2757 59.9969 70.4928
temp: 298.150 k
press: 1.00000 atm
elementType: 15 8 8 8 8 1 1 1
symmnumber: 1
zpe: 116162.4 jmol-1
zpe.correction: 0.044244 hartree
zpe.thermalcorrener: 0.051041 hartree
zpe.thermalcorrenthalpy: 0.051985 hartree
zpe.thermalcorrgfe: 0.014301 hartree
zpe.sumelectzpe: -643.489095 hartree
zpe.sumelectthermal: -643.482298 hartree
zpe.sumelectthermalent: -643.481353 hartree
zpe.sumelectthermalfe: -643.519038 hartree
dipole: -0.7796 3.0855 -0.7032
dipole: 3.2593
quadrupole: -33.3687 -40.6999 -33.7844
quadrupole: 3.5919 -2.7751 3.5835
quadrupole: 2.5823 -4.7489 2.1666 3.5919 -2.7751 3.5835
hfenergy: -643.5333386 hartree
pointgroup: C01 [X(H3O4P1)]
dipole: -1.0457901 0.6486114 0.3603999 debye
dipolederiv: 1.883539 -0.0219071 -0.0136383 0.1411931 2.1753071 -0.0825538 0.092046 0.0635389 1.9425206 -0.6397492 -0.1591495 -0.352896 -0.0907939 -0.8320933 -0.140211 -0.2652895 -0.1621621 -0.7389291 -0.8177934 0.0195829 0.3033497 0.0252214 -0.5859164 0.2308006 0.1833166 0.1906029 -0.9052407 -0.5508736 0.2163401 -0.1763579 0.1371556 -1.1375424 0.0497283 -0.1358146 0.0159655 -0.6291862 -0.6640097 0.0442192 0.0163306 -0.0201458 -0.6537837 -0.0031499 0.0090499 0.0182676 -0.5925229 0.2098666 -0.0112333 0.1223232 -0.0455304 0.3987841 -0.0178555 0.075207 -0.0203773 0.3117948 0.3678238 -0.0721819 0.0007812 -0.0717555 0.2970569 -0.0900825 -0.0686326 -0.1369148 0.2714022 0.2111964 -0.0156704 0.1001076 -0.0753446 0.3381877 0.0533237 0.1101172 0.0310795 0.3401612 unknown
polarizability: 39.4383144|2.5440613|34.4016465|-1.2442235|0.8484582|33.0826347 unknown
InChI: InChI=1S/H3O4P/c1-5(2,3)4/h1-3H
charge 0 multiplicity 1
8 atoms
P  0.017669 -0.018697 -0.105471
O  -0.589889 -0.927315 -1.410356
O  -1.019638 -0.658666 1.100402
O  -0.666345 1.564213 -0.214562
O  1.588134 -0.058331 0.046197
H  -1.514877 -1.263183 -1.286084
H  -0.999789 -0.223592 1.988056
H  -0.095665 2.233871 -0.670483
