program: Orca
programVersion: 5.0.2
elementType: Br Br Br Br O O O N C C C C C C C C C C C C C C C C C C C C C C H H H H H H H H H H H H H H H H H H H
charge: 0
multiplicity: 1
keywords: wb97x-d3
keywords: def2-TZVPP
keywords: def2/J RIJCOSX
keywords: DEFGRID2
keywords: scfconv7
keywords: smallprint printgap noloewdin
keywords: NOSOSCF
formula: C22H19Br4NO3
InChI: InChI=1/C22H19Br4NO3/c1-21(2)17(19(23)22(24,25)26)18(21)20(28)30-16(12-27)13-7-6-10-15(11-13)29-14-8-4-3-5-9-14/h3-11,16-19H,1-2H3
49 atoms
Br 4.195985 -1.895322 -0.44571
Br 3.111784 -0.766516 2.639153
Br 0.353246 -2.179605 2.159458
Br 2.987386 -3.860457 2.104115
O  -1.972567 -0.084592 -0.441815
O  -0.419903 1.458741 0.003339
O  -3.803321 5.425547 -1.368783
N  -5.115069 -0.601492 0.408266
C  1.353565 -0.408566 -1.824624
C  1.659956 -0.656034 -0.382424
C  0.22362 -0.688406 -0.848342
C  2.310958 -1.91844 0.103014
C  1.577808 -1.479726 -2.865294
C  1.59238 0.982597 -2.357981
C  -0.705359 0.356181 -0.383855
C  2.221727 -2.146395 1.622029
C  -2.983907 0.836469 -0.057594
C  -3.280051 1.854075 -1.135199
C  -4.169401 0.015759 0.199942
C  -3.415265 3.188956 -0.787549
C  -3.450816 1.446366 -2.453353
C  -3.726673 4.124184 -1.765893
C  -3.750359 2.393003 -3.419607
C  -3.89036 3.73307 -3.088453
C  -4.70522 6.26794 -1.966626
C  -6.042421 5.917234 -2.10692
C  -4.250179 7.512756 -2.373868
C  -6.925289 6.829626 -2.665639
C  -5.147103 8.419522 -2.922423
C  -6.483951 8.080969 -3.076103
H  1.942513 0.238348 0.164561
H  -0.228785 -1.666539 -0.966696
H  1.868347 -2.793835 -0.379242
H  0.913202 -1.309912 -3.714111
H  2.601562 -1.449434 -3.239559
H  1.379912 -2.48779 -2.500963
H  2.59577 1.037427 -2.783879
H  0.882779 1.220887 -3.152125
H  1.520899 1.755817 -1.596439
H  -2.724772 1.33897 0.880342
H  -3.281925 3.508148 0.239423
H  -3.355449 0.403985 -2.730208
H  -3.877909 2.087233 -4.449659
H  -4.118761 4.458187 -3.859191
H  -6.397922 4.948216 -1.778486
H  -3.205326 7.771585 -2.255984
H  -7.967763 6.559253 -2.774066
H  -4.792854 9.392439 -3.237774
H  -7.179342 8.788384 -3.508341
elementType: Br O N C H
nucrepener: 5396.28141849 hartree
twoeener: 9799.87128067 hartree
cpcmener: -0.03117362 hartree
xcener: -389.798971236891 hartree
chargesum: 0.0000000
charge: -0.079416 -0.011496 -0.010643 -0.002143 -0.277766 -0.431098 -0.326780 -0.086252 0.094856 -0.086920 -0.142173 -0.155752 -0.261425 -0.261557 0.382509 0.034577 0.410964 0.023015 -0.226081 -0.220480 -0.217613 0.235540 -0.148202 -0.153160 0.247058 -0.166136 -0.228491 -0.151233 -0.130571 -0.172844 0.120050 0.116107 0.164930 0.108747 0.098210 0.091962 0.099156 0.103045 0.095630 0.140404 0.135224 0.148303 0.160366 0.158178 0.157200 0.147033 0.159128 0.157438 0.158602
qa: -0.0794 -0.0115 -0.0106 -0.0021 -0.2778 -0.4311 -0.3268 -0.0863 0.0949 -0.0869 -0.1422 -0.1558 -0.2614 -0.2616 0.3825 0.0346 0.4110 0.0230 -0.2261 -0.2205 -0.2176 0.2355 -0.1482 -0.1532 0.2471 -0.1661 -0.2285 -0.1512 -0.1306 -0.1728 0.1201 0.1161 0.1649 0.1087 0.0982 0.0920 0.0992 0.1030 0.0956 0.1404 0.1352 0.1483 0.1604 0.1582 0.1572 0.1470 0.1591 0.1574 0.1586
va: 1.1843 1.2226 1.2293 1.2294 2.1200 2.0854 2.0709 3.1134 3.8637 3.7392 3.8829 4.0647 3.9012 3.9003 4.1613 4.3529 3.7150 3.6321 4.0760 4.0746 3.9655 3.7899 3.9254 3.8974 3.7154 3.9066 3.9997 3.8949 3.8894 3.8942 1.0433 1.0258 0.9950 1.0029 1.0064 1.0040 1.0026 1.0000 1.0185 1.0192 1.0184 1.0122 0.9910 0.9954 0.9962 1.0067 0.9904 0.9895 0.9901
dispcorr: -0.028706312 hartree
energy: -11427.174640872296
dipole: -129.71418 129.90969 0.19551 125.05192 -124.41743 0.63449 -98.01209 95.86480 -2.14729
magnitude: 2.24759 au
magnitude: 5.71291 debye
