program: Orca
programVersion: 5.0.2
elementType: Br Br Br Br O O O N C C C C C C C C C C C C C C C C C C C C C C H H H H H H H H H H H H H H H H H H H
charge: 0
multiplicity: 1
keywords: wb97x-d3
keywords: def2-TZVPP
keywords: def2/J RIJCOSX
keywords: DEFGRID2
keywords: scfconv7
keywords: smallprint printgap noloewdin
keywords: NOSOSCF
formula: C22H19Br4NO3
InChI: InChI=1/C22H19Br4NO3/c1-21(2)17(19(23)22(24,25)26)18(21)20(28)30-16(12-27)13-7-6-10-15(11-13)29-14-8-4-3-5-9-14/h3-11,16-19H,1-2H3
49 atoms
Br 4.154881 -2.313743 1.324245
Br 1.695022 -4.223057 -0.16171
Br 0.833459 -1.742991 -1.880419
Br 3.772873 -2.794522 -2.050811
O  -1.348298 0.928205 0.4051
O  -1.348313 -0.966933 1.583559
O  -5.313394 4.960667 1.022458
N  -3.636169 -1.039078 -1.122681
C  1.642056 -0.026575 2.168383
C  1.569737 -1.178436 1.218372
C  0.729299 0.046573 0.954425
C  2.683936 -1.537519 0.280614
C  2.814437 0.924395 2.146398
C  1.076094 -0.228935 3.551498
C  -0.735779 -0.083453 1.041744
C  2.285956 -2.513512 -0.840824
C  -2.770623 0.910712 0.394373
C  -3.259711 2.229049 -0.146733
C  -3.240113 -0.195763 -0.450397
C  -4.028947 3.04233 0.670196
C  -2.947578 2.625325 -1.442675
C  -4.508043 4.252808 0.183902
C  -3.428695 3.836108 -1.912614
C  -4.214703 4.654061 -1.112256
C  -5.344765 6.329057 0.99478
C  -6.586157 6.929349 1.149558
C  -4.191777 7.09781 0.891974
C  -6.673158 8.312849 1.20636
C  -4.296325 8.480668 0.937006
C  -5.531772 9.09451 1.094367
H  1.019094 -2.02883 1.60839
H  1.073554 0.729093 0.185338
H  3.094488 -0.644997 -0.199119
H  3.61674 0.563818 2.790871
H  3.226533 1.080403 1.149467
H  2.504958 1.901118 2.522057
H  1.858508 -0.605994 4.212416
H  0.721633 0.716481 3.965732
H  0.254369 -0.941504 3.581122
H  -3.167549 0.750051 1.400933
H  -4.26939 2.73782 1.681947
H  -2.347547 1.994637 -2.087164
H  -3.202613 4.14827 -2.923603
H  -4.596559 5.586313 -1.508234
H  -7.474676 6.316152 1.234119
H  -3.219888 6.632445 0.784393
H  -7.64175 8.778945 1.333885
H  -3.398927 9.080392 0.856007
H  -5.603277 10.173443 1.13415
elementType: Br O N C H
nucrepener: 5387.62625160 hartree
twoeener: 9791.71495187 hartree
cpcmener: -0.03297350 hartree
xcener: -389.799110405910 hartree
chargesum: -0.0000000
charge: -0.080325 -0.011585 -0.013273 -0.003081 -0.270683 -0.429458 -0.323461 -0.085431 0.093857 -0.092874 -0.140950 -0.153914 -0.262505 -0.260892 0.383461 0.041000 0.434485 0.006365 -0.240908 -0.211697 -0.217601 0.260193 -0.147514 -0.175873 0.292083 -0.251375 -0.201683 -0.119317 -0.140577 -0.184854 0.118221 0.118683 0.165881 0.099376 0.091625 0.109172 0.099912 0.103147 0.095199 0.124977 0.136849 0.148742 0.160400 0.157615 0.145835 0.157488 0.157937 0.159088 0.158236
qa: -0.0803 -0.0116 -0.0133 -0.0031 -0.2707 -0.4295 -0.3235 -0.0854 0.0939 -0.0929 -0.1410 -0.1539 -0.2625 -0.2609 0.3835 0.0410 0.4345 0.0064 -0.2409 -0.2117 -0.2176 0.2602 -0.1475 -0.1759 0.2921 -0.2514 -0.2017 -0.1193 -0.1406 -0.1849 0.1182 0.1187 0.1659 0.0994 0.0916 0.1092 0.0999 0.1031 0.0952 0.1250 0.1368 0.1487 0.1604 0.1576 0.1458 0.1575 0.1579 0.1591 0.1582
va: 1.1840 1.2230 1.2294 1.2297 2.1618 2.0758 2.0822 3.1085 3.8647 3.7309 3.9000 4.0656 3.9026 3.8998 4.1686 4.3488 3.7017 3.7313 4.0179 4.0369 3.9925 3.7911 3.9306 3.9192 3.6795 4.0121 3.9193 3.8850 3.8880 3.9069 1.0465 1.0228 0.9952 1.0057 1.0038 1.0027 1.0023 1.0000 1.0171 1.0233 1.0172 1.0086 0.9912 0.9953 1.0084 0.9966 0.9892 0.9902 0.9905
dispcorr: -0.028125268 hartree
energy: -11427.174787978998
dipole: -121.89804 122.76185 0.86381 156.14955 -152.57826 3.57129 45.80709 -45.04507 0.76202
magnitude: 3.75246 au
magnitude: 9.53799 debye
