program: Orca
programVersion: 5.0.2
elementType: Br Br Br Br O O O N C C C C C C C C C C C C C C C C C C C C C C H H H H H H H H H H H H H H H H H H H
charge: 0
multiplicity: 1
keywords: wb97x-d3
keywords: def2-TZVPP
keywords: def2/J RIJCOSX
keywords: DEFGRID2
keywords: scfconv7
keywords: smallprint printgap noloewdin
keywords: NOSOSCF
formula: C22H19Br4NO3
InChI: InChI=1/C22H19Br4NO3/c1-21(2)17(19(23)22(24,25)26)18(21)20(28)30-16(12-27)13-7-6-10-15(11-13)29-14-8-4-3-5-9-14/h3-11,16-19H,1-2H3
49 atoms
Br 3.556501 0.742023 0.958871
Br 2.553352 -2.427675 1.925541
Br 1.157982 -2.797648 -0.858662
Br 4.212211 -2.15026 -0.742098
O  -2.502603 -0.502976 -0.924277
O  -1.929027 -0.790695 1.217381
O  -4.932808 3.724897 0.497864
N  -4.771849 -1.770684 -2.939174
C  0.1915 1.415934 0.279867
C  0.83435 0.095159 0.566299
C  -0.363592 0.144902 -0.343186
C  2.175968 -0.285145 0.013594
C  0.806398 2.392181 -0.693237
C  -0.531301 2.09299 1.416686
C  -1.640887 -0.435705 0.105978
C  2.508662 -1.783267 0.105368
C  -3.810293 -0.962274 -0.647344
C  -4.715222 0.107814 -0.065955
C  -4.335064 -1.411965 -1.939497
C  -4.343352 1.445435 -0.085692
C  -5.938721 -0.284537 0.458172
C  -5.21734 2.396827 0.428938
C  -6.802753 0.67848 0.957546
C  -6.451475 2.017016 0.944213
C  -3.861663 4.267419 -0.16518
C  -3.748247 4.190243 -1.547282
C  -2.927769 4.962433 0.587965
C  -2.67495 4.808515 -2.172155
C  -1.866765 5.58957 -0.051118
C  -1.732751 5.509363 -1.429891
H  0.634902 -0.278571 1.565597
H  -0.184875 0.065826 -1.409807
H  2.261686 0.001093 -1.038019
H  1.515457 3.049496 -0.188837
H  1.323629 1.910466 -1.523004
H  0.025416 3.021356 -1.124269
H  0.161571 2.747171 1.949104
H  -1.346188 2.714121 1.041661
H  -0.94302 1.396155 2.143947
H  -3.792802 -1.832803 0.017991
H  -3.389151 1.74651 -0.496345
H  -6.218594 -1.330692 0.474842
H  -7.760889 0.383527 1.364521
H  -7.123915 2.768429 1.338546
H  -4.48735 3.656983 -2.132461
H  -3.034183 5.015903 1.664324
H  -2.580721 4.74606 -3.248575
H  -1.139344 6.135286 0.535902
H  -0.90093 5.992749 -1.925193
elementType: Br O N C H
nucrepener: 5642.02755453 hartree
cpcmener: -0.03055929 hartree
xcener: -389.805090678892 hartree
chargesum: -0.0000000
charge: -0.080646 -0.009750 -0.012340 -0.002093 -0.280406 -0.418942 -0.320170 -0.084116 0.133741 -0.085742 -0.157534 -0.170323 -0.279343 -0.246532 0.371893 0.039494 0.391727 0.036300 -0.233850 -0.234706 -0.254520 0.346497 -0.089988 -0.261088 0.295614 -0.219599 -0.232002 -0.110473 -0.126629 -0.195642 0.117970 0.119058 0.167681 0.103848 0.096737 0.100316 0.106741 0.062650 0.103158 0.147720 0.133887 0.145677 0.158171 0.146043 0.157124 0.148632 0.160249 0.157459 0.158047
qa: -0.0806 -0.0098 -0.0123 -0.0021 -0.2804 -0.4189 -0.3202 -0.0841 0.1337 -0.0857 -0.1575 -0.1703 -0.2793 -0.2465 0.3719 0.0395 0.3917 0.0363 -0.2338 -0.2347 -0.2545 0.3465 -0.0900 -0.2611 0.2956 -0.2196 -0.2320 -0.1105 -0.1266 -0.1956 0.1180 0.1191 0.1677 0.1038 0.0967 0.1003 0.1067 0.0627 0.1032 0.1477 0.1339 0.1457 0.1582 0.1460 0.1571 0.1486 0.1602 0.1575 0.1580
va: 1.1835 1.2254 1.2261 1.2303 2.1060 2.0915 2.1012 3.1173 3.8068 3.7501 3.8704 4.0808 3.9033 3.8760 4.1786 4.3487 3.7141 3.6920 4.0640 3.9551 4.0167 3.6834 3.8835 4.0050 3.6313 3.9375 3.9574 3.8337 3.8239 3.8692 1.0454 1.0255 0.9942 1.0044 1.0075 1.0084 1.0052 1.0229 1.0220 1.0179 1.0158 1.0024 0.9886 1.0081 0.9970 1.0069 0.9885 0.9897 0.9915
dispcorr: -0.032989552 hartree
energy: -11427.177363939794
dipole: -141.17849 141.48284 0.30435 100.07194 -98.38685 1.68509 -11.87565 12.09721 0.22156
magnitude: 1.72663 au
magnitude: 4.38873 debye
