program: Orca
programVersion: 5.0.2
elementType: Br Br Br Br O O O N C C C C C C C C C C C C C C C C C C C C C C H H H H H H H H H H H H H H H H H H H
charge: 0
multiplicity: 1
keywords: wb97x-d3
keywords: def2-TZVPP
keywords: def2/J RIJCOSX
keywords: DEFGRID2
keywords: scfconv7
keywords: smallprint printgap noloewdin
keywords: NOSOSCF
formula: C22H19Br4NO3
InChI: InChI=1/C22H19Br4NO3/c1-21(2)17(19(23)22(24,25)26)18(21)20(28)30-16(12-27)13-7-6-10-15(11-13)29-14-8-4-3-5-9-14/h3-11,16-19H,1-2H3
49 atoms
Br 3.847846 0.124883 0.770323
Br 2.187775 -2.144644 2.789955
Br 0.954406 -3.467297 0.222103
Br 4.064564 -3.284797 0.542178
O  -2.2431 -0.619146 -1.290915
O  -1.797941 -0.417271 0.889219
O  -3.154943 4.275457 -1.559251
N  -4.886022 -1.168839 -3.19392
C  0.743604 0.940492 -0.572633
C  1.091722 -0.232397 0.294437
C  -0.013973 -0.369904 -0.712545
C  2.369224 -1.003499 0.136427
C  1.60151 1.325552 -1.753393
C  0.106212 2.128827 0.104446
C  -1.409471 -0.478305 -0.246673
C  2.402055 -2.349787 0.880803
C  -3.630287 -0.505435 -1.001494
C  -4.007163 0.900688 -0.593072
C  -4.314507 -0.878585 -2.240924
C  -3.476615 1.976314 -1.29257
C  -4.864736 1.108765 0.47589
C  -3.786295 3.267261 -0.894556
C  -5.186213 2.406996 0.846153
C  -4.645686 3.492636 0.175488
C  -3.792713 5.466782 -1.783036
C  -3.06527 6.62669 -1.562735
C  -5.090101 5.521902 -2.27705
C  -3.64262 7.856453 -1.845984
C  -5.657954 6.758867 -2.545787
C  -4.940134 7.928528 -2.333148
H  0.761476 -0.122395 1.32254
H  0.197387 -0.906957 -1.631237
H  2.577212 -1.210291 -0.916855
H  2.070002 0.473942 -2.246522
H  0.988364 1.830634 -2.501999
H  2.388642 2.018194 -1.45358
H  0.885978 2.800356 0.468276
H  -0.511801 2.693036 -0.59646
H  -0.512415 1.859407 0.958872
H  -3.936095 -1.218993 -0.229171
H  -2.81141 1.826822 -2.134953
H  -5.271026 0.267465 1.022787
H  -5.849397 2.578449 1.683655
H  -4.88437 4.499104 0.494889
H  -2.053756 6.565046 -1.18108
H  -5.653038 4.614813 -2.460303
H  -3.073384 8.761528 -1.677597
H  -6.668226 6.804293 -2.931566
H  -5.388661 8.889263 -2.549071
elementType: Br O N C H
nucrepener: 5486.07152035 hartree
twoeener: 9889.75262381 hartree
cpcmener: -0.03115611 hartree
xcener: -389.801193256025 hartree
chargesum: -0.0000000
charge: -0.083270 -0.012704 -0.012408 -0.001477 -0.274438 -0.413260 -0.330396 -0.086586 0.111127 -0.094239 -0.150718 -0.158934 -0.265976 -0.266284 0.365982 0.038723 0.418401 0.048701 -0.230358 -0.292148 -0.199734 0.270755 -0.123900 -0.178867 0.252026 -0.235138 -0.171935 -0.130462 -0.154259 -0.172501 0.115334 0.121427 0.167001 0.092290 0.110321 0.098740 0.107594 0.095710 0.097233 0.143484 0.140021 0.145322 0.160567 0.159298 0.147015 0.157809 0.157610 0.158983 0.158517
qa: -0.0833 -0.0127 -0.0124 -0.0015 -0.2744 -0.4133 -0.3304 -0.0866 0.1111 -0.0942 -0.1507 -0.1589 -0.2660 -0.2663 0.3660 0.0387 0.4184 0.0487 -0.2304 -0.2921 -0.1997 0.2708 -0.1239 -0.1789 0.2520 -0.2351 -0.1719 -0.1305 -0.1543 -0.1725 0.1153 0.1214 0.1670 0.0923 0.1103 0.0987 0.1076 0.0957 0.0972 0.1435 0.1400 0.1453 0.1606 0.1593 0.1470 0.1578 0.1576 0.1590 0.1585
va: 1.1815 1.2226 1.2252 1.2306 2.1238 2.0984 2.0466 3.1118 3.8605 3.7583 3.8494 4.0692 3.8946 3.8977 4.2245 4.3531 3.7052 3.5644 4.0827 4.0330 3.9908 3.7199 3.9058 3.9337 3.7229 4.0013 3.9084 3.8937 3.8993 3.8936 1.0456 1.0230 0.9940 1.0037 1.0029 1.0056 1.0046 1.0041 1.0142 1.0136 1.0263 1.0027 0.9901 0.9946 1.0064 0.9969 0.9898 0.9905 0.9901
dispcorr: -0.030453631 hartree
energy: -11427.175234788789
dipole: -136.56563 136.44974 -0.11589 131.56007 -129.88242 1.67765 -54.93560 55.17939 0.24379
magnitude: 1.69923 au
magnitude: 4.31910 debye
