program: Orca
programVersion: 5.0.2
elementType: Br Br Br Br O O O N C C C C C C C C C C C C C C C C C C C C C C H H H H H H H H H H H H H H H H H H H
charge: 0
multiplicity: 1
keywords: wb97x-d3
keywords: def2-TZVPP
keywords: def2/J RIJCOSX
keywords: DEFGRID2
keywords: scfconv7
keywords: smallprint printgap noloewdin
keywords: NOSOSCF
formula: C22H19Br4NO3
InChI: InChI=1/C22H19Br4NO3/c1-21(2)17(19(23)22(24,25)26)18(21)20(28)30-16(12-27)13-7-6-10-15(11-13)29-14-8-4-3-5-9-14/h3-11,16-19H,1-2H3
49 atoms
Br 3.924717 -1.488912 -1.031724
Br 3.19815 0.041455 1.980582
Br 0.856363 -1.99386 2.425433
Br 3.768306 -3.059818 2.019519
O  -2.439615 -1.050707 -0.024999
O  -1.176847 0.786948 0.123922
O  -5.118567 4.08795 -0.915452
N  -5.389782 -2.064698 1.027753
C  0.568589 -0.96297 -1.903202
C  1.213095 -0.829195 -0.559506
C  -0.223476 -1.274183 -0.644819
C  2.249603 -1.787707 -0.052048
C  0.859515 -2.147429 -2.792248
C  0.301714 0.30496 -2.674961
C  -1.283495 -0.380041 -0.147288
C  2.516742 -1.690798 1.459526
C  -3.567624 -0.299353 0.403714
C  -4.085092 0.632831 -0.666471
C  -4.578973 -1.301195 0.747952
C  -4.34247 1.955005 -0.341574
C  -4.287437 0.17121 -1.961779
C  -4.825095 2.818972 -1.314828
C  -4.757755 1.049318 -2.925674
C  -5.03445 2.372493 -2.6133
C  -4.881495 5.147303 -1.751139
C  -3.687653 5.277954 -2.449784
C  -5.859036 6.128464 -1.825223
C  -3.481999 6.406311 -3.230196
C  -5.634916 7.256432 -2.601921
C  -4.450541 7.398413 -3.310917
H  1.356885 0.199778 -0.245031
H  -0.424478 -2.330063 -0.50117
H  1.95893 -2.82053 -0.264012
H  1.731631 -1.957868 -3.418636
H  1.035137 -3.070145 -2.239145
H  0.011153 -2.327998 -3.454752
H  1.144816 0.515744 -3.334927
H  -0.587964 0.196951 -3.298288
H  0.16304 1.17566 -2.037319
H  -3.341733 0.261348 1.317202
H  -4.170772 2.319164 0.664312
H  -4.086101 -0.860389 -2.222483
H  -4.922807 0.699296 -3.936159
H  -5.414604 3.039399 -3.376796
H  -2.920078 4.516541 -2.38386
H  -6.783365 6.011981 -1.273228
H  -2.551843 6.51073 -3.773847
H  -6.396811 8.023429 -2.656346
H  -4.280858 8.27697 -3.919307
elementType: Br O N C H
nucrepener: 5454.45590206 hartree
twoeener: 9857.86848331 hartree
cpcmener: -0.03150137 hartree
xcener: -389.801943058266 hartree
chargesum: -0.0000000
charge: -0.079815 -0.012105 -0.012065 -0.001108 -0.271463 -0.425720 -0.327414 -0.085814 0.095710 -0.084380 -0.142211 -0.161694 -0.262446 -0.260944 0.376162 0.036929 0.403623 0.026792 -0.225234 -0.217294 -0.229474 0.244564 -0.138847 -0.161856 0.259490 -0.175206 -0.235210 -0.150108 -0.128317 -0.176824 0.117110 0.118142 0.166242 0.099152 0.090965 0.108993 0.101203 0.100745 0.095724 0.141117 0.135121 0.147878 0.160854 0.158892 0.159192 0.146299 0.159135 0.157417 0.158096
qa: -0.0798 -0.0121 -0.0121 -0.0011 -0.2715 -0.4257 -0.3274 -0.0858 0.0957 -0.0844 -0.1422 -0.1617 -0.2624 -0.2609 0.3762 0.0369 0.4036 0.0268 -0.2252 -0.2173 -0.2295 0.2446 -0.1388 -0.1619 0.2595 -0.1752 -0.2352 -0.1501 -0.1283 -0.1768 0.1171 0.1181 0.1662 0.0992 0.0910 0.1090 0.1012 0.1007 0.0957 0.1411 0.1351 0.1479 0.1609 0.1589 0.1592 0.1463 0.1591 0.1574 0.1581
va: 1.1843 1.2230 1.2269 1.2311 2.1271 2.0901 2.0731 3.1130 3.8750 3.7304 3.8583 4.0692 3.8987 3.9005 4.1808 4.3527 3.7267 3.6018 4.0785 4.0710 3.9648 3.7865 3.9145 3.9092 3.7077 3.9031 4.0028 3.8958 3.8899 3.8992 1.0457 1.0249 0.9945 1.0059 1.0040 1.0024 1.0033 1.0008 1.0167 1.0163 1.0183 1.0119 0.9903 0.9947 0.9962 1.0074 0.9906 0.9893 0.9902
dispcorr: -0.029182254 hartree
energy: -11427.174899882977
dipole: -145.43133 145.88326 0.45193 86.36131 -85.80142 0.55989 -87.44258 85.28507 -2.15751
magnitude: 2.27432 au
magnitude: 5.78087 debye
