program: Orca
programVersion: 5.0.2
elementType: Br Br Br Br O O O N C C C C C C C C C C C C C C C C C C C C C C H H H H H H H H H H H H H H H H H H H
charge: 0
multiplicity: 1
keywords: wb97x-d3
keywords: def2-TZVPP
keywords: def2/J RIJCOSX
keywords: DEFGRID2
keywords: scfconv7
keywords: smallprint printgap noloewdin
keywords: NOSOSCF
formula: C22H19Br4NO3
InChI: InChI=1/C22H19Br4NO3/c1-21(2)17(19(23)22(24,25)26)18(21)20(28)30-16(12-27)13-7-6-10-15(11-13)29-14-8-4-3-5-9-14/h3-11,16-19H,1-2H3
49 atoms
Br 3.640327 -1.475295 -1.460384
Br 3.310149 0.823726 1.111738
Br 1.188799 -1.044678 2.466066
Br 4.056757 -2.137173 1.86922
O  -2.463886 -0.699566 0.489764
O  -1.283228 1.059099 -0.233735
O  -5.297288 2.870301 -2.818206
N  -4.657248 -0.999549 2.932487
C  0.165182 -1.224743 -1.880285
C  1.010357 -0.721989 -0.753626
C  -0.407475 -1.152933 -0.474199
C  2.155253 -1.500485 -0.17659
C  0.344745 -2.620536 -2.427247
C  -0.25076 -0.228121 -2.93398
C  -1.391596 -0.129632 -0.080083
C  2.652103 -0.990722 1.186535
C  -3.530951 0.16404 0.883439
C  -4.503653 0.372747 -0.251119
C  -4.158387 -0.498482 2.027814
C  -4.446899 1.565597 -0.963529
C  -5.396846 -0.627517 -0.611354
C  -5.302262 1.755164 -2.041428
C  -6.244572 -0.422058 -1.689921
C  -6.205525 0.762439 -2.404784
C  -4.638263 4.003744 -2.410248
C  -3.588036 4.460531 -3.190337
C  -5.053161 4.704513 -1.285526
C  -2.948452 5.642926 -2.842463
C  -4.397605 5.877723 -0.942073
C  -3.345976 6.350663 -1.7170
H  1.162293 0.352567 -0.771527
H  -0.549772 -2.120893 -0.007154
H  1.888554 -2.552915 -0.04908
H  1.108717 -2.637055 -3.205244
H  0.620651 -3.351729 -1.667365
H  -0.589487 -2.961533 -2.87678
H  0.469606 -0.245232 -3.753613
H  -1.227705 -0.485745 -3.34693
H  -0.29842 0.794488 -2.565785
H  -3.146531 1.124797 1.237776
H  -3.737054 2.32927 -0.674227
H  -5.444748 -1.557764 -0.05877
H  -6.950032 -1.191453 -1.974546
H  -6.869927 0.922232 -3.24471
H  -3.280843 3.902416 -4.066006
H  -5.880268 4.342266 -0.687075
H  -2.132759 6.007004 -3.453703
H  -4.717192 6.427375 -0.066153
H  -2.843024 7.26984 -1.446495
elementType: Br O N C H
nucrepener: 5534.75257780 hartree
twoeener: 9938.48614284 hartree
cpcmener: -0.02917895 hartree
xcener: -389.801010034121 hartree
chargesum: -0.0000000
charge: -0.080519 -0.011485 -0.011957 -0.002185 -0.267867 -0.439671 -0.321535 -0.086951 0.097454 -0.089502 -0.160440 -0.157761 -0.262690 -0.266181 0.413288 0.037428 0.398407 -0.029771 -0.221626 -0.168139 -0.217277 0.299619 -0.117777 -0.239479 0.257855 -0.214309 -0.191144 -0.135247 -0.143289 -0.166652 0.116616 0.117874 0.167461 0.098875 0.091993 0.109065 0.099803 0.105278 0.095378 0.134303 0.134777 0.141013 0.158500 0.147114 0.147108 0.157026 0.158595 0.159532 0.159092
qa: -0.0805 -0.0115 -0.0120 -0.0022 -0.2679 -0.4397 -0.3215 -0.0870 0.0975 -0.0895 -0.1604 -0.1578 -0.2627 -0.2662 0.4133 0.0374 0.3984 -0.0298 -0.2216 -0.1681 -0.2173 0.2996 -0.1178 -0.2395 0.2579 -0.2143 -0.1911 -0.1352 -0.1433 -0.1667 0.1166 0.1179 0.1675 0.0989 0.0920 0.1091 0.0998 0.1053 0.0954 0.1343 0.1348 0.1410 0.1585 0.1471 0.1471 0.1570 0.1586 0.1595 0.1591
va: 1.1830 1.2230 1.2268 1.2299 2.1301 2.0726 2.0912 3.1117 3.8665 3.7303 3.8936 4.0652 3.8993 3.9029 4.1473 4.3499 3.7394 3.7169 4.0640 3.8904 4.0026 3.7428 3.9165 4.0146 3.6999 4.0065 3.9442 3.8879 3.8869 3.8955 1.0458 1.0243 0.9938 1.0058 1.0039 1.0025 1.0029 0.9989 1.0172 1.0198 1.0281 1.0092 0.9898 1.0071 1.0056 0.9968 0.9894 0.9899 0.9900
dispcorr: -0.029231576 hartree
energy: -11427.174926553840
dipole: -152.98300 152.84330 -0.13970 52.57558 -52.55500 0.02059 -68.11011 66.36271 -1.74740
magnitude: 1.75310 au
magnitude: 4.45603 debye
