program: Orca
programVersion: 5.0.2
elementType: Br Br Br Br O O O N C C C C C C C C C C C C C C C C C C C C C C H H H H H H H H H H H H H H H H H H H
charge: 0
multiplicity: 1
keywords: wb97x-d3
keywords: def2-TZVPP
keywords: def2/J RIJCOSX
keywords: DEFGRID2
keywords: scfconv7
keywords: smallprint printgap noloewdin
keywords: NOSOSCF
formula: C22H19Br4NO3
InChI: InChI=1/C22H19Br4NO3/c1-21(2)17(19(23)22(24,25)26)18(21)20(28)30-16(12-27)13-7-6-10-15(11-13)29-14-8-4-3-5-9-14/h3-11,16-19H,1-2H3
49 atoms
Br 3.958011 -1.704567 -1.011086
Br 3.294796 -0.163404 2.021825
Br 0.848533 -2.091396 2.415786
Br 3.715539 -3.278819 2.027833
O  -2.351374 -0.797741 0.006197
O  -0.948275 0.939742 0.019706
O  -5.074631 4.36833 -0.976825
N  -5.320337 -1.522338 1.218462
C  0.646578 -1.025794 -1.908345
C  1.296416 -0.903877 -0.566504
C  -0.17323 -1.229944 -0.645442
C  2.265091 -1.922733 -0.042634
C  0.836522 -2.2628 -2.75286
C  0.498333 0.231316 -2.728161
C  -1.149141 -0.229618 -0.177671
C  2.530164 -1.850865 1.470374
C  -3.399836 0.062231 0.426651
C  -3.90149 0.965786 -0.677062
C  -4.468393 -0.837895 0.865707
C  -4.223707 2.278335 -0.372968
C  -4.056517 0.47986 -1.969989
C  -4.724289 3.112062 -1.365677
C  -4.542423 1.327908 -2.952412
C  -4.885094 2.641017 -2.662771
C  -5.059909 5.403423 -1.876593
C  -3.93171 5.687558 -2.635839
C  -6.190186 6.202435 -1.954393
C  -3.947986 6.784148 -3.484893
C  -6.188482 7.303261 -2.800321
C  -5.072284 7.595205 -3.571048
H  1.520078 0.118842 -0.279373
H  -0.46739 -2.259052 -0.472093
H  1.924782 -2.937265 -0.266387
H  -0.019431 -2.388314 -3.41811
H  1.727399 -2.175395 -3.375708
H  0.922691 -3.178215 -2.16747
H  -0.388927 0.177562 -3.361726
H  0.428602 1.133701 -2.124596
H  1.365256 0.34272 -3.381541
H  -3.095048 0.658226 1.29386
H  -4.091967 2.659284 0.632885
H  -3.80677 -0.54448 -2.215105
H  -4.669112 0.96143 -3.962617
H  -5.277628 3.27763 -3.445094
H  -3.047315 5.066373 -2.564657
H  -7.059803 5.968971 -1.352867
H  -3.070716 7.008437 -4.077832
H  -7.068343 7.930972 -2.857376
H  -5.0755 8.452056 -4.231883
elementType: Br O N C H
nucrepener: 5424.57313348 hartree
twoeener: 9828.03795878 hartree
cpcmener: -0.03155015 hartree
xcener: -389.801494551126 hartree
chargesum: -0.0000000
charge: -0.080307 -0.010493 -0.011794 -0.001158 -0.275871 -0.426192 -0.324086 -0.085846 0.097289 -0.087685 -0.146207 -0.160597 -0.261447 -0.259571 0.377781 0.034456 0.408366 0.028532 -0.227062 -0.232427 -0.226704 0.266284 -0.144302 -0.172985 0.258452 -0.182236 -0.228754 -0.144980 -0.129302 -0.173714 0.117360 0.118764 0.168956 0.108800 0.098651 0.091844 0.100300 0.095873 0.100688 0.142729 0.133742 0.147112 0.160131 0.157019 0.158835 0.146445 0.159252 0.157790 0.158268
qa: -0.0803 -0.0105 -0.0118 -0.0012 -0.2759 -0.4262 -0.3241 -0.0858 0.0973 -0.0877 -0.1462 -0.1606 -0.2614 -0.2596 0.3778 0.0345 0.4084 0.0285 -0.2271 -0.2324 -0.2267 0.2663 -0.1443 -0.1730 0.2585 -0.1822 -0.2288 -0.1450 -0.1293 -0.1737 0.1174 0.1188 0.1690 0.1088 0.0987 0.0918 0.1003 0.0959 0.1007 0.1427 0.1337 0.1471 0.1601 0.1570 0.1588 0.1464 0.1593 0.1578 0.1583
va: 1.1849 1.2232 1.2273 1.2308 2.1213 2.0883 2.0795 3.1140 3.8689 3.7417 3.8704 4.0656 3.9000 3.8990 4.1755 4.3521 3.7132 3.6280 4.0762 4.0863 3.9603 3.7757 3.9262 3.9007 3.7029 3.9245 4.0066 3.8894 3.8870 3.8970 1.0451 1.0241 0.9939 1.0025 1.0062 1.0043 1.0012 1.0173 1.0033 1.0178 1.0187 1.0130 0.9909 0.9964 0.9957 1.0069 0.9902 0.9894 0.9902
dispcorr: -0.028977165 hartree
energy: -11427.174841399259
dipole: -146.65590 147.02481 0.36891 95.12193 -94.59176 0.53016 -89.50980 87.25672 -2.25309
magnitude: 2.34384 au
magnitude: 5.95756 debye
