program: Orca
programVersion: 5.0.2
elementType: Br Br Br Br O O O N C C C C C C C C C C C C C C C C C C C C C C H H H H H H H H H H H H H H H H H H H
charge: 0
multiplicity: 1
keywords: wb97x-d3
keywords: def2-TZVPP
keywords: def2/J RIJCOSX
keywords: DEFGRID2
keywords: scfconv7
keywords: smallprint printgap noloewdin
keywords: NOSOSCF
formula: C22H19Br4NO3
InChI: InChI=1/C22H19Br4NO3/c1-21(2)17(19(23)22(24,25)26)18(21)20(28)30-16(12-27)13-7-6-10-15(11-13)29-14-8-4-3-5-9-14/h3-11,16-19H,1-2H3
49 atoms
Br 3.623934 -2.682187 1.608423
Br 2.872998 -2.502304 -1.769282
Br 1.678944 0.366373 -1.311548
Br 4.647013 -0.207736 -0.527265
O  -2.100613 -0.021198 0.294606
O  -1.635242 -2.11138 -0.373431
O  -5.678448 3.810281 1.524609
N  -2.695598 1.436142 -2.648933
C  0.232682 -2.006974 2.187329
C  1.0063 -1.900822 0.91273
C  -0.169376 -0.981123 1.140985
C  2.400735 -1.350645 0.841641
C  0.772746 -1.42907 3.473472
C  -0.584266 -3.256107 2.40367
C  -1.352875 -1.139258 0.27621
C  2.871207 -0.982322 -0.576046
C  -3.267033 0.023694 -0.523388
C  -4.406746 0.613185 0.265111
C  -2.943371 0.81964 -1.712029
C  -4.482693 1.982278 0.494574
C  -5.361562 -0.247029 0.790733
C  -5.545476 2.486707 1.232066
C  -6.404469 0.269379 1.544989
C  -6.507008 1.633203 1.759742
C  -5.310932 4.777675 0.627853
C  -4.7282 5.923128 1.1513
C  -5.56488 4.668874 -0.734204
C  -4.397014 6.96947 0.302797
C  -5.215226 5.718458 -1.571929
C  -4.632116 6.870465 -1.061517
H  0.812258 -2.714889 0.221455
H  0.048358 0.042761 1.422937
H  2.503036 -0.454666 1.459422
H  1.417689 -2.147388 3.980833
H  1.338554 -0.508463 3.331385
H  -0.053025 -1.195419 4.14768
H  0.018067 -3.995282 2.934667
H  -1.461841 -3.043513 3.016825
H  -0.921292 -3.71708 1.477867
H  -3.542111 -0.976211 -0.868677
H  -3.725596 2.648546 0.097022
H  -5.293419 -1.312093 0.608679
H  -7.153761 -0.394065 1.956028
H  -7.329479 2.040415 2.334272
H  -4.54368 5.995548 2.215938
H  -6.033512 3.783756 -1.146064
H  -3.946985 7.863816 0.714131
H  -5.409997 5.633156 -2.633276
H  -4.367114 7.685722 -1.721641
elementType: Br O N C H
nucrepener: 5469.12170819 hartree
twoeener: 9873.28775566 hartree
cpcmener: -0.03009306 hartree
xcener: -389.797566832289 hartree
chargesum: -0.0000000
charge: -0.080868 -0.011469 -0.014141 -0.002038 -0.273186 -0.433192 -0.324560 -0.086604 0.097109 -0.098448 -0.168564 -0.148971 -0.260805 -0.262356 0.409866 0.040530 0.421620 0.011420 -0.234147 -0.201923 -0.185572 0.254379 -0.115487 -0.231931 0.295572 -0.253790 -0.200898 -0.117119 -0.138542 -0.187804 0.117896 0.118873 0.166951 0.099193 0.091808 0.108344 0.099105 0.103802 0.094886 0.125372 0.144625 0.147294 0.159749 0.148525 0.146011 0.155322 0.156955 0.159332 0.157878
qa: -0.0809 -0.0115 -0.0141 -0.0020 -0.2732 -0.4332 -0.3246 -0.0866 0.0971 -0.0984 -0.1686 -0.1490 -0.2608 -0.2624 0.4099 0.0405 0.4216 0.0114 -0.2341 -0.2019 -0.1856 0.2544 -0.1155 -0.2319 0.2956 -0.2538 -0.2009 -0.1171 -0.1385 -0.1878 0.1179 0.1189 0.1670 0.0992 0.0918 0.1083 0.0991 0.1038 0.0949 0.1254 0.1446 0.1473 0.1597 0.1485 0.1460 0.1553 0.1570 0.1593 0.1579
va: 1.1838 1.2233 1.2271 1.2307 2.1395 2.0810 2.0864 3.1079 3.8631 3.7392 3.8932 4.0623 3.9030 3.9030 4.1623 4.3453 3.6949 3.7235 4.0724 3.9840 3.9324 3.7740 3.8980 4.0148 3.6825 4.0112 3.9110 3.8823 3.8890 3.9099 1.0452 1.0230 0.9943 1.0059 1.0039 1.0027 1.0023 0.9997 1.0177 1.0369 1.0102 1.0008 0.9893 1.0055 1.0083 0.9975 0.9893 0.9901 0.9906
dispcorr: -0.028537134 hartree
energy: -11427.174220954908
dipole: -163.20692 162.08470 -1.12221 61.41430 -61.48268 -0.06838 40.92372 -38.60927 2.31444
magnitude: 2.57307 au
magnitude: 6.54023 debye
