program: Orca
programVersion: 5.0.2
elementType: Br Br Br Br O O O N C C C C C C C C C C C C C C C C C C C C C C H H H H H H H H H H H H H H H H H H H
charge: 0
multiplicity: 1
keywords: wb97x-d3
keywords: def2-TZVPP
keywords: def2/J RIJCOSX
keywords: DEFGRID2
keywords: scfconv7
keywords: smallprint printgap noloewdin
keywords: NOSOSCF
formula: C22H19Br4NO3
InChI: InChI=1/C22H19Br4NO3/c1-21(2)17(19(23)22(24,25)26)18(21)20(28)30-16(12-27)13-7-6-10-15(11-13)29-14-8-4-3-5-9-14/h3-11,16-19H,1-2H3
49 atoms
Br 3.697336 -1.109641 -0.803502
Br 1.00397 1.087989 -1.167162
Br 0.150525 0.416744 1.773096
Br 3.005238 1.554826 1.215141
O  -1.618999 -2.445666 -0.539138
O  -1.976991 -3.296128 1.491961
O  -3.24433 2.257199 0.820182
N  -3.309039 -1.970519 -3.32655
C  1.292915 -3.529656 0.038541
C  1.143779 -2.047993 -0.103016
C  0.247874 -2.789547 0.855383
C  2.153051 -1.063923 0.407571
C  2.429962 -4.11954 0.836848
C  0.895666 -4.381312 -1.140889
C  -1.210682 -2.885135 0.65642
C  1.632967 0.379896 0.51415
C  -3.021792 -2.402709 -0.765279
C  -3.692917 -1.293579 0.010742
C  -3.162286 -2.163712 -2.202381
C  -3.128627 -0.022794 0.003269
C  -4.85659 -1.555389 0.715372
C  -3.749664 0.995194 0.711725
C  -5.468927 -0.524998 1.415629
C  -4.923631 0.746834 1.416352
C  -2.434061 2.813385 -0.139728
C  -2.652788 2.643819 -1.500384
C  -1.418359 3.640978 0.318578
C  -1.826564 3.300347 -2.402719
C  -0.615545 4.305914 -0.594529
C  -0.810208 4.134394 -1.957909
H  0.678734 -1.751262 -1.036266
H  0.494773 -2.73085 1.909605
H  2.534335 -1.353386 1.39045
H  2.695228 -3.527158 1.712403
H  2.153163 -5.112935 1.192776
H  3.320964 -4.227439 0.217467
H  0.554126 -5.362864 -0.809225
H  0.110946 -3.935295 -1.748323
H  1.761971 -4.532366 -1.786576
H  -3.49348 -3.364716 -0.540397
H  -2.21682 0.163226 -0.550098
H  -5.280383 -2.551092 0.718829
H  -6.377968 -0.714756 1.970065
H  -5.398406 1.548701 1.967082
H  -3.456778 2.016917 -1.864244
H  -1.264858 3.767488 1.382476
H  -1.993341 3.164953 -3.463335
H  0.174349 4.951675 -0.234363
H  -0.175482 4.646639 -2.668562
elementType: Br O N C H
nucrepener: 6098.22474954 hartree
cpcmener: -0.03531069 hartree
xcener: -389.809585510541 hartree
chargesum: -0.0000000
charge: -0.087660 -0.017591 -0.021375 -0.008236 -0.264974 -0.447587 -0.327133 -0.098760 0.100819 -0.099935 -0.146315 -0.135525 -0.270633 -0.260079 0.395450 0.060680 0.390226 0.034354 -0.218741 -0.281753 -0.226769 0.363819 -0.094715 -0.265068 0.339990 -0.219234 -0.281604 -0.133100 -0.079830 -0.207768 0.125576 0.124172 0.170410 0.094801 0.108607 0.097809 0.104541 0.094353 0.098267 0.148829 0.115958 0.148538 0.162318 0.148254 0.159901 0.139102 0.159600 0.152582 0.155428
qa: -0.0877 -0.0176 -0.0214 -0.0082 -0.2650 -0.4476 -0.3271 -0.0988 0.1008 -0.0999 -0.1463 -0.1355 -0.2706 -0.2601 0.3954 0.0607 0.3902 0.0344 -0.2187 -0.2818 -0.2268 0.3638 -0.0947 -0.2651 0.3400 -0.2192 -0.2816 -0.1331 -0.0798 -0.2078 0.1256 0.1242 0.1704 0.0948 0.1086 0.0978 0.1045 0.0944 0.0983 0.1488 0.1160 0.1485 0.1623 0.1483 0.1599 0.1391 0.1596 0.1526 0.1554
va: 1.1793 1.2231 1.2174 1.2277 2.1275 2.0565 2.0801 3.1037 3.8722 3.7128 3.9127 4.0186 3.9086 3.9065 4.1459 4.2968 3.7336 3.6369 4.0772 3.9705 3.9836 3.6203 3.8718 4.0155 3.6007 3.8932 3.9767 3.8472 3.8189 3.8814 1.0326 1.0200 0.9944 1.0039 1.0026 1.0054 1.0008 1.0122 1.0024 1.0139 1.0300 1.0025 0.9875 1.0066 0.9970 1.0144 0.9900 0.9906 0.9923
dispcorr: -0.036961187 hartree
energy: -11427.164072999130
dipole: -85.62650 86.14579 0.51929 -36.38136 35.51346 -0.86789 -10.79139 11.69016 0.89876
magnitude: 1.35302 au
magnitude: 3.43911 debye
