program: Orca
programVersion: 5.0.2
elementType: Br Br Br Br O O O N C C C C C C C C C C C C C C C C C C C C C C H H H H H H H H H H H H H H H H H H H
charge: 0
multiplicity: 1
keywords: wb97x-d3
keywords: def2-TZVPP
keywords: def2/J RIJCOSX
keywords: DEFGRID2
keywords: scfconv7
keywords: smallprint printgap noloewdin
keywords: NOSOSCF
formula: C22H19Br4NO3
InChI: InChI=1/C22H19Br4NO3/c1-21(2)17(19(23)22(24,25)26)18(21)20(28)30-16(12-27)13-7-6-10-15(11-13)29-14-8-4-3-5-9-14/h3-11,16-19H,1-2H3
49 atoms
Br 3.859683 -0.950866 0.289116
Br 1.664618 1.669815 0.464355
Br -0.504111 -0.219134 1.714184
Br 2.262167 0.133968 3.145032
O  -2.185317 -2.789886 -0.736783
O  -1.34442 -1.250934 -2.124059
O  -3.808316 2.589937 -0.692209
N  -4.220359 -2.285959 -3.465441
C  1.388084 -2.731206 -1.448321
C  1.235607 -1.473096 -0.658371
C  0.109153 -2.483393 -0.671215
C  1.945286 -1.209363 0.636434
C  2.229511 -3.875082 -0.936551
C  1.413318 -2.602741 -2.950801
C  -1.17249 -2.090227 -1.276252
C  1.404408 0.004026 1.413653
C  -3.518005 -2.332908 -0.948725
C  -3.756476 -1.037382 -0.211208
C  -3.866891 -2.281396 -2.370924
C  -3.748644 0.19021 -0.854168
C  -3.892871 -1.103674 1.17288
C  -3.828674 1.354469 -0.100388
C  -4.008344 0.065561 1.90735
C  -3.961084 1.301783 1.277489
C  -2.924006 2.827654 -1.717833
C  -3.344325 3.682473 -2.726242
C  -1.645323 2.283474 -1.735749
C  -2.474638 3.993212 -3.762107
C  -0.793177 2.589842 -2.786501
C  -1.200372 3.444004 -3.802428
H  1.070203 -0.593034 -1.272719
H  0.01044 -3.099557 0.215162
H  1.875768 -2.077636 1.297045
H  3.268791 -3.757368 -1.243747
H  2.204693 -3.976208 0.148303
H  1.86514 -4.813394 -1.35719
H  2.444323 -2.484062 -3.287031
H  1.01333 -3.502527 -3.420368
H  0.849406 -1.748275 -3.317851
H  -4.141133 -3.118184 -0.514697
H  -3.668829 0.250681 -1.932139
H  -3.909232 -2.06359 1.673444
H  -4.121642 0.018305 2.982005
H  -4.027175 2.216739 1.851616
H  -4.341714 4.10239 -2.698772
H  -1.310938 1.625811 -0.943891
H  -2.802956 4.661889 -4.546878
H  0.198847 2.157444 -2.806934
H  -0.529291 3.680053 -4.617181
elementType: Br O N C H
nucrepener: 6014.89000729 hartree
cpcmener: -0.03860124 hartree
xcener: -389.807028440262 hartree
chargesum: -0.0000000
charge: -0.083406 -0.021531 -0.028271 -0.007551 -0.275505 -0.457944 -0.338633 -0.094023 0.090829 -0.100501 -0.080578 -0.168781 -0.262452 -0.264039 0.383950 0.087789 0.471159 -0.003106 -0.238800 -0.160922 -0.262861 0.245345 -0.135456 -0.199225 0.271070 -0.241922 -0.128835 -0.133496 -0.131082 -0.181891 0.114098 0.116156 0.168863 0.098725 0.092470 0.109791 0.100144 0.104759 0.092997 0.148476 0.142652 0.145174 0.163109 0.149054 0.148458 0.084067 0.160994 0.148999 0.161684
qa: -0.0834 -0.0215 -0.0283 -0.0076 -0.2755 -0.4579 -0.3386 -0.0940 0.0908 -0.1005 -0.0806 -0.1688 -0.2625 -0.2640 0.3840 0.0878 0.4712 -0.0031 -0.2388 -0.1609 -0.2629 0.2453 -0.1355 -0.1992 0.2711 -0.2419 -0.1288 -0.1335 -0.1311 -0.1819 0.1141 0.1162 0.1689 0.0987 0.0925 0.1098 0.1001 0.1048 0.0930 0.1485 0.1427 0.1452 0.1631 0.1491 0.1485 0.0841 0.1610 0.1490 0.1617
va: 1.1816 1.2205 1.2367 1.2282 2.1352 2.0327 2.0765 3.1036 3.8921 3.7489 3.8622 4.0709 3.8970 3.8965 4.1129 4.2851 3.8430 3.5725 4.0705 3.9039 3.9333 3.7820 3.8266 3.9726 3.7574 3.9856 3.8659 3.8907 3.8710 3.9244 1.0314 1.0290 0.9916 1.0050 1.0037 1.0028 1.0018 0.9996 1.0188 0.9920 1.0167 1.0075 0.9888 1.0032 1.0072 1.0313 0.9877 0.9952 0.9892
dispcorr: -0.036029559 hartree
energy: -11427.164142225784
dipole: -81.57246 82.15208 0.57962 -18.68014 17.01968 -1.66046 -73.10894 75.10393 1.99499
magnitude: 2.65953 au
magnitude: 6.75998 debye
