program: Orca
programVersion: 5.0.2
elementType: Br Br Br Br O O O N C C C C C C C C C C C C C C C C C C C C C C H H H H H H H H H H H H H H H H H H H
charge: 0
multiplicity: 1
keywords: wb97x-d3
keywords: def2-TZVPP
keywords: def2/J RIJCOSX
keywords: DEFGRID2
keywords: scfconv7
keywords: smallprint printgap noloewdin
keywords: NOSOSCF
formula: C22H19Br4NO3
InChI: InChI=1/C22H19Br4NO3/c1-21(2)17(19(23)22(24,25)26)18(21)20(28)30-16(12-27)13-7-6-10-15(11-13)29-14-8-4-3-5-9-14/h3-11,16-19H,1-2H3
49 atoms
Br 3.169094 0.753192 -0.712158
Br 0.831915 1.283039 1.779819
Br 0.847588 -1.792059 2.399788
Br 3.505283 -0.147132 2.578941
O  -1.809393 -1.781453 -0.587439
O  -1.341499 -3.944773 -0.845724
O  -3.949215 2.683448 -1.544002
N  -4.024909 -3.016504 -2.848146
C  0.980754 -1.598166 -2.068872
C  0.919411 -0.967516 -0.710838
C  0.444545 -2.387169 -0.885876
C  2.142698 -0.701834 0.116658
C  2.280104 -2.103792 -2.646884
C  0.042427 -1.05432 -3.118549
C  -0.966414 -2.80014 -0.770768
C  1.855983 -0.345355 1.584156
C  -3.203192 -2.059944 -0.553782
C  -3.90126 -0.753948 -0.278286
C  -3.641179 -2.612442 -1.841597
C  -3.625317 0.336038 -1.094888
C  -4.770388 -0.638492 0.794162
C  -4.193554 1.564204 -0.798662
C  -5.366785 0.589864 1.051134
C  -5.073204 1.695044 0.270698
C  -2.750673 2.800672 -2.211235
C  -2.790537 3.199569 -3.537337
C  -1.538777 2.575482 -1.56949
C  -1.60009 3.374068 -4.230986
C  -0.358657 2.737747 -2.278596
C  -0.382674 3.135558 -3.609577
H  0.144803 -0.212848 -0.619927
H  1.115484 -3.172075 -0.553061
H  2.806796 -1.570367 0.118491
H  2.802679 -1.309372 -3.179948
H  2.955543 -2.512378 -1.895734
H  2.074574 -2.901279 -3.362441
H  -0.874017 -0.635097 -2.706286
H  0.540674 -0.258639 -3.674736
H  -0.230611 -1.83452 -3.830788
H  -3.440849 -2.790988 0.22437
H  -2.963333 0.223797 -1.945408
H  -4.975318 -1.492587 1.426272
H  -6.049363 0.692919 1.883725
H  -5.519111 2.657061 0.488404
H  -3.742817 3.373792 -4.021834
H  -1.515303 2.275225 -0.529487
H  -1.630353 3.687421 -5.266101
H  0.586838 2.557612 -1.783497
H  0.542275 3.262392 -4.155755
elementType: Br O N C H
nucrepener: 5907.23852082 hartree
cpcmener: -0.03860093 hartree
xcener: -389.801682685850 hartree
chargesum: 0.0000000
charge: -0.084463 -0.020673 -0.011702 -0.000970 -0.250689 -0.451765 -0.337000 -0.094792 0.156862 -0.066284 -0.203116 -0.156350 -0.269552 -0.267666 0.431109 0.054508 0.385553 0.005912 -0.222315 -0.228578 -0.205187 0.263678 -0.109597 -0.237827 0.290054 -0.252681 -0.191351 -0.106181 -0.107037 -0.205335 0.085901 0.125754 0.171483 0.097678 0.093172 0.110443 0.059551 0.101815 0.115484 0.137427 0.179493 0.150917 0.162156 0.150401 0.148357 0.142684 0.161763 0.140306 0.158649
qa: -0.0845 -0.0207 -0.0117 -0.0010 -0.2507 -0.4518 -0.3370 -0.0948 0.1569 -0.0663 -0.2031 -0.1563 -0.2696 -0.2677 0.4311 0.0545 0.3856 0.0059 -0.2223 -0.2286 -0.2052 0.2637 -0.1096 -0.2378 0.2901 -0.2527 -0.1914 -0.1062 -0.1070 -0.2053 0.0859 0.1258 0.1715 0.0977 0.0932 0.1104 0.0596 0.1018 0.1155 0.1374 0.1795 0.1509 0.1622 0.1504 0.1484 0.1427 0.1618 0.1403 0.1586
va: 1.1817 1.2164 1.2278 1.2304 2.1616 2.0459 2.0807 3.1058 3.7984 3.7009 3.9844 4.0275 3.9070 3.9363 4.1156 4.3357 3.7823 3.6982 4.0295 3.9242 3.9507 3.7800 3.8912 4.0091 3.7321 4.0156 3.8956 3.8630 3.7844 3.9282 1.0409 1.0210 0.9911 1.0054 1.0037 1.0021 1.0063 1.0028 1.0063 1.0162 0.9791 1.0003 0.9880 1.0049 1.0068 0.9995 0.9868 1.0035 0.9913
dispcorr: -0.035378535 hartree
energy: -11427.164077727946
dipole: -92.43646 93.33658 0.90013 -1.94693 2.87918 0.93225 -86.91354 87.69569 0.78215
magnitude: 1.51363 au
magnitude: 3.84735 debye
