program: Orca
programVersion: 5.0.2
elementType: Br Br Br Br O O O N C C C C C C C C C C C C C C C C C C C C C C H H H H H H H H H H H H H H H H H H H
charge: 0
multiplicity: 1
keywords: wb97x-d3
keywords: def2-TZVPP
keywords: def2/J RIJCOSX
keywords: DEFGRID2
keywords: scfconv7
keywords: smallprint printgap noloewdin
keywords: NOSOSCF
formula: C22H19Br4NO3
InChI: InChI=1/C22H19Br4NO3/c1-21(2)17(19(23)22(24,25)26)18(21)20(28)30-16(12-27)13-7-6-10-15(11-13)29-14-8-4-3-5-9-14/h3-11,16-19H,1-2H3
49 atoms
Br 3.659882 -0.837326 -1.396564
Br 3.027025 0.619689 1.672648
Br 0.897613 -1.602638 2.258558
Br 3.852611 -2.415741 1.638606
O  -2.534017 -0.965676 0.294397
O  -1.544355 1.030244 0.064511
O  -5.507949 3.250124 -1.882562
N  -4.731986 -2.165496 2.435994
C  0.221263 -0.536115 -2.023736
C  0.946862 -0.385295 -0.727025
C  -0.455348 -0.948041 -0.727024
C  2.084589 -1.269604 -0.309234
C  0.545095 -1.66953 -2.966324
C  -0.187061 0.727248 -2.741764
C  -1.531499 -0.163943 -0.099822
C  2.453244 -1.158139 1.180134
C  -3.674471 -0.343498 0.891126
C  -4.633236 0.135177 -0.16927
C  -4.264265 -1.372686 1.746891
C  -4.66188 1.487536 -0.47734
C  -5.414055 -0.76778 -0.882797
C  -5.44867 1.928346 -1.532864
C  -6.22702 -0.305227 -1.905017
C  -6.238327 1.03957 -2.246183
C  -4.356642 4.002029 -1.882851
C  -3.134153 3.490213 -2.303558
C  -4.474361 5.327926 -1.492337
C  -2.023171 4.321517 -2.317547
C  -3.356519 6.149826 -1.52436
C  -2.126156 5.650893 -1.929354
H  1.027932 0.643967 -0.392303
H  -0.547821 -2.02086 -0.602176
H  1.855642 -2.319613 -0.51286
H  -0.327084 -1.896334 -3.581151
H  1.358026 -1.390501 -3.636989
H  0.827574 -2.589341 -2.454813
H  -0.327434 1.575122 -2.075281
H  0.589838 1.000258 -3.457386
H  -1.11155 0.572538 -3.300571
H  -3.375584 0.48335 1.542086
H  -4.067382 2.186834 0.096462
H  -5.396842 -1.824552 -0.646254
H  -6.845623 -0.999695 -2.457164
H  -6.856704 1.396715 -3.059628
H  -3.037535 2.459265 -2.620873
H  -5.433344 5.713132 -1.169903
H  -1.071226 3.921182 -2.642373
H  -3.450799 7.184379 -1.221568
H  -1.255514 6.292608 -1.944904
elementType: Br O N C H
nucrepener: 5617.03148040 hartree
cpcmener: -0.03523279 hartree
xcener: -389.799472387577 hartree
chargesum: 0.0000000
charge: -0.081327 -0.013126 -0.013210 -0.001861 -0.270564 -0.463082 -0.339439 -0.099399 0.109942 -0.095832 -0.155147 -0.155083 -0.260626 -0.270545 0.427360 0.038697 0.409921 -0.003981 -0.215580 -0.175858 -0.207215 0.268828 -0.130053 -0.225615 0.299760 -0.213992 -0.253098 -0.142202 -0.123434 -0.193571 0.121883 0.118181 0.167463 0.109824 0.098686 0.093238 0.079292 0.103014 0.109559 0.139071 0.147644 0.143839 0.163073 0.151204 0.167781 0.147804 0.165867 0.160787 0.161120
qa: -0.0813 -0.0131 -0.0132 -0.0019 -0.2706 -0.4631 -0.3394 -0.0994 0.1099 -0.0958 -0.1551 -0.1551 -0.2606 -0.2705 0.4274 0.0387 0.4099 -0.0040 -0.2156 -0.1759 -0.2072 0.2688 -0.1301 -0.2256 0.2998 -0.2140 -0.2531 -0.1422 -0.1234 -0.1936 0.1219 0.1182 0.1675 0.1098 0.0987 0.0932 0.0793 0.1030 0.1096 0.1391 0.1476 0.1438 0.1631 0.1512 0.1678 0.1478 0.1659 0.1608 0.1611
va: 1.1833 1.2225 1.2278 1.2304 2.1292 2.0425 2.0738 3.1097 3.8557 3.7324 3.9009 4.0611 3.9001 3.9066 4.1080 4.3493 3.7333 3.6450 4.0657 3.9141 3.9885 3.7304 3.9076 4.0264 3.6922 3.8938 4.0060 3.8746 3.8822 3.9232 1.0401 1.0258 0.9934 1.0024 1.0053 1.0041 1.0159 1.0049 0.9965 1.0176 1.0156 1.0082 0.9885 1.0036 0.9864 1.0076 0.9873 0.9876 0.9900
dispcorr: -0.031327713 hartree
energy: -11427.161092538256
dipole: -141.94560 142.17360 0.22800 58.76178 -58.60959 0.15219 -70.34386 68.26727 -2.07658
magnitude: 2.09460 au
magnitude: 5.32405 debye
