program: Orca
programVersion: 5.0.2
elementType: Br Br Br Br O O O N C C C C C C C C C C C C C C C C C C C C C C H H H H H H H H H H H H H H H H H H H
charge: 0
multiplicity: 1
keywords: wb97x-d3
keywords: def2-TZVPP
keywords: def2/J RIJCOSX
keywords: DEFGRID2
keywords: scfconv7
keywords: smallprint printgap noloewdin
keywords: NOSOSCF
formula: C22H19Br4NO3
InChI: InChI=1/C22H19Br4NO3/c1-21(2)17(19(23)22(24,25)26)18(21)20(28)30-16(12-27)13-7-6-10-15(11-13)29-14-8-4-3-5-9-14/h3-11,16-19H,1-2H3
49 atoms
Br 3.563967 -1.522014 -1.387288
Br 3.127725 1.164133 0.725421
Br 1.369104 -0.631178 2.608199
Br 4.304215 -1.479459 1.961611
O  -2.562631 -1.257433 0.687632
O  -1.556065 0.578328 -0.102186
O  -5.47888 2.662105 -2.442795
N  -5.266233 -2.009384 2.411555
C  0.086371 -1.79684 -1.518068
C  0.915542 -0.978078 -0.576901
C  -0.404984 -1.524724 -0.105685
C  2.196116 -1.482776 0.020806
C  0.427597 -3.236063 -1.818542
C  -0.533291 -1.081349 -2.69282
C  -1.524997 -0.600519 0.145359
C  2.718646 -0.660044 1.210201
C  -3.762156 -0.512805 0.886739
C  -4.460033 -0.214348 -0.418306
C  -4.592873 -1.361529 1.741342
C  -4.658617 1.105983 -0.790606
C  -4.856741 -1.255313 -1.250418
C  -5.238066 1.383494 -2.021757
C  -5.456516 -0.961594 -2.464263
C  -5.640436 0.355134 -2.860851
C  -4.574807 3.663568 -2.186155
C  -5.099775 4.927043 -1.953842
C  -3.200146 3.459134 -2.216048
C  -4.240665 5.996893 -1.749412
C  -2.354266 4.537368 -1.995799
C  -2.865607 5.807097 -1.762124
H  0.916384 0.08232 -0.808811
H  -0.385719 -2.395571 0.54044
H  2.087983 -2.514398 0.366843
H  1.139187 -3.301644 -2.641879
H  0.843059 -3.770744 -0.964902
H  -0.475385 -3.768506 -2.121137
H  -0.721896 -0.026376 -2.503485
H  0.137462 -1.142489 -3.55099
H  -1.476922 -1.551019 -2.975323
H  -3.56487 0.412211 1.438059
H  -4.352658 1.905216 -0.127006
H  -4.703562 -2.286612 -0.957124
H  -5.774319 -1.763285 -3.116897
H  -6.095992 0.583813 -3.81577
H  -6.172745 5.070613 -1.9393
H  -2.783097 2.478647 -2.409243
H  -4.652825 6.981468 -1.571597
H  -1.283984 4.378733 -2.014488
H  -2.197783 6.641252 -1.594362
elementType: Br O N C H
nucrepener: 5577.06208348 hartree
twoeener: 9980.37071228 hartree
cpcmener: -0.03594989 hartree
xcener: -389.798135923189 hartree
chargesum: 0.0000000
charge: -0.083914 -0.013674 -0.012659 -0.003006 -0.266565 -0.452791 -0.337227 -0.100086 0.099330 -0.089447 -0.154420 -0.156042 -0.267739 -0.252180 0.403648 0.036404 0.415836 0.026788 -0.218647 -0.207182 -0.242233 0.290723 -0.121279 -0.229616 0.298765 -0.256169 -0.196821 -0.123035 -0.154421 -0.188541 0.118351 0.123158 0.169597 0.098504 0.094638 0.110033 0.086924 0.102591 0.102951 0.141762 0.150832 0.148389 0.163341 0.151347 0.148220 0.162163 0.161563 0.160822 0.161009
qa: -0.0839 -0.0137 -0.0127 -0.0030 -0.2666 -0.4528 -0.3372 -0.1001 0.0993 -0.0894 -0.1544 -0.1560 -0.2677 -0.2522 0.4036 0.0364 0.4158 0.0268 -0.2186 -0.2072 -0.2422 0.2907 -0.1213 -0.2296 0.2988 -0.2562 -0.1968 -0.1230 -0.1544 -0.1885 0.1184 0.1232 0.1696 0.0985 0.0946 0.1100 0.0869 0.1026 0.1030 0.1418 0.1508 0.1484 0.1633 0.1513 0.1482 0.1622 0.1616 0.1608 0.1610
va: 1.1808 1.2216 1.2248 1.2291 2.1397 2.0548 2.0751 3.1101 3.8753 3.7437 3.8613 4.0576 3.8963 3.9010 4.1631 4.3543 3.7209 3.5553 4.0782 3.9388 3.9730 3.7119 3.8969 4.0195 3.6757 4.0029 3.8952 3.8784 3.8973 3.9029 1.0418 1.0229 0.9932 1.0055 1.0035 1.0021 1.0150 1.0043 1.0007 1.0153 1.0065 1.0100 0.9879 1.0040 1.0078 0.9915 0.9877 0.9904 0.9892
dispcorr: -0.030456120 hartree
energy: -11427.159869022267
dipole: -151.04799 151.49885 0.45086 28.56338 -28.95316 -0.38978 -65.38156 63.98651 -1.39506
magnitude: 1.51703 au
magnitude: 3.85599 debye
