program: Orca
programVersion: 5.0.2
elementType: Br Br Br Br O O O N C C C C C C C C C C C C C C C C C C C C C C H H H H H H H H H H H H H H H H H H H
charge: 0
multiplicity: 1
keywords: wb97x-d3
keywords: def2-TZVPP
keywords: def2/J RIJCOSX
keywords: DEFGRID2
keywords: scfconv7
keywords: smallprint printgap noloewdin
keywords: NOSOSCF
formula: C22H19Br4NO3
InChI: InChI=1/C22H19Br4NO3/c1-21(2)17(19(23)22(24,25)26)18(21)20(28)30-16(12-27)13-7-6-10-15(11-13)29-14-8-4-3-5-9-14/h3-11,16-19H,1-2H3
49 atoms
Br 3.604616 0.330742 1.142548
Br 2.004549 -2.701265 1.437777
Br 0.820436 -2.345101 -1.44548
Br 3.917181 -2.317223 -1.031083
O  -1.955998 -0.232771 0.638082
O  -2.259175 0.129948 -1.541094
O  -4.824777 3.902571 0.643778
N  -3.553017 -2.900145 -0.706213
C  0.463846 1.708462 0.364664
C  0.865469 0.27025 0.42059
C  -0.171492 0.711386 -0.589706
C  2.182754 -0.244091 -0.080611
C  1.358622 2.732299 -0.291908
C  -0.295876 2.269493 1.540818
C  -1.551915 0.200124 -0.566968
C  2.235295 -1.772742 -0.240703
C  -3.270072 -0.746786 0.754541
C  -4.359066 0.278368 0.503967
C  -3.422106 -1.936159 -0.092934
C  -4.085005 1.62007 0.721237
C  -5.631493 -0.118769 0.111818
C  -5.069088 2.566059 0.472926
C  -6.618073 0.83689 -0.081498
C  -6.341649 2.18587 0.077183
C  -3.627928 4.424511 0.211922
C  -3.06838 5.43445 0.980266
C  -3.019871 4.007821 -0.967563
C  -1.891232 6.038861 0.560089
C  -1.839193 4.615376 -1.369046
C  -1.269851 5.631676 -0.612044
H  0.48149 -0.254401 1.288827
H  0.179675 0.820305 -1.609901
H  2.425824 0.194813 -1.051968
H  2.082193 3.123486 0.423681
H  1.905397 2.340421 -1.148897
H  0.758376 3.571244 -0.646011
H  -0.980572 3.0563 1.218271
H  -0.865784 1.521038 2.086128
H  0.409302 2.71566 2.243799
H  -3.33329 -1.094813 1.78931
H  -3.111064 1.94316 1.065513
H  -5.865135 -1.163467 -0.04911
H  -7.60864 0.527611 -0.386311
H  -7.10207 2.933456 -0.107379
H  -3.552793 5.747638 1.89638
H  -3.454017 3.222884 -1.573638
H  -1.457726 6.828326 1.159803
H  -1.3652 4.290874 -2.286215
H  -0.349676 6.100649 -0.933784
elementType: Br O N C H
nucrepener: 5767.00154543 hartree
cpcmener: -0.03936825 hartree
xcener: -389.808075798657 hartree
chargesum: 0.0000000
charge: -0.081042 -0.012847 -0.012294 -0.003137 -0.269783 -0.437971 -0.340432 -0.092455 0.114667 -0.095087 -0.137702 -0.171932 -0.273051 -0.257481 0.392409 0.043586 0.466862 -0.029281 -0.239893 -0.228704 -0.206662 0.255325 -0.115780 -0.233553 0.278639 -0.229159 -0.175043 -0.119617 -0.171110 -0.194011 0.131113 0.123218 0.168848 0.100817 0.097153 0.104324 0.057152 0.101932 0.111774 0.148328 0.190658 0.137096 0.162092 0.149986 0.147809 0.153991 0.161219 0.166322 0.162707
qa: -0.0810 -0.0128 -0.0123 -0.0031 -0.2698 -0.4380 -0.3404 -0.0925 0.1147 -0.0951 -0.1377 -0.1719 -0.2731 -0.2575 0.3924 0.0436 0.4669 -0.0293 -0.2399 -0.2287 -0.2067 0.2553 -0.1158 -0.2336 0.2786 -0.2292 -0.1750 -0.1196 -0.1711 -0.1940 0.1311 0.1232 0.1688 0.1008 0.0972 0.1043 0.0572 0.1019 0.1118 0.1483 0.1907 0.1371 0.1621 0.1500 0.1478 0.1540 0.1612 0.1663 0.1627
va: 1.1833 1.2229 1.2309 1.2291 2.1341 2.0464 2.0750 3.0996 3.8208 3.7402 3.9096 4.0610 3.9003 3.8953 4.1244 4.3433 3.7951 3.7526 4.0971 3.9373 3.9598 3.7581 3.9038 4.0151 3.6763 3.9777 3.8378 3.8655 3.8318 3.8528 1.0354 1.0218 0.9926 1.0064 1.0064 1.0152 1.0217 1.0122 1.0076 0.9914 0.9692 1.0125 0.9882 1.0041 1.0069 1.0031 0.9878 0.9881 0.9888
dispcorr: -0.035581360 hartree
energy: -11427.162062607082
dipole: -124.55433 124.99065 0.43632 108.72291 -106.39745 2.32546 2.76631 -1.32937 1.43694
magnitude: 2.76820 au
magnitude: 7.03620 debye
