program: Orca
programVersion: 5.0.2
elementType: Br Br Br Br O O O N C C C C C C C C C C C C C C C C C C C C C C H H H H H H H H H H H H H H H H H H H
charge: 0
multiplicity: 1
keywords: wb97x-d3
keywords: def2-TZVPP
keywords: def2/J RIJCOSX
keywords: DEFGRID2
keywords: scfconv7
keywords: smallprint printgap noloewdin
keywords: NOSOSCF
formula: C22H19Br4NO3
InChI: InChI=1/C22H19Br4NO3/c1-21(2)17(19(23)22(24,25)26)18(21)20(28)30-16(12-27)13-7-6-10-15(11-13)29-14-8-4-3-5-9-14/h3-11,16-19H,1-2H3
49 atoms
Br 3.547345 -2.101438 -1.328441
Br 3.526267 0.594484 0.812101
Br 1.341078 -0.836772 2.558155
Br 4.095729 -2.239421 2.053557
O  -2.38037 -0.616203 0.715514
O  -1.18398 0.914226 -0.396064
O  -5.202194 2.73853 -2.955588
N  -4.646529 -0.439664 3.110155
C  0.097906 -1.691086 -1.646971
C  1.017627 -1.058515 -0.652869
C  -0.408764 -1.347014 -0.254573
C  2.136738 -1.810493 0.004958
C  0.178303 -3.167888 -1.951115
C  -0.303976 -0.86709 -2.844569
C  -1.322956 -0.219372 -0.010688
C  2.741436 -1.119562 1.238639
C  -3.402413 0.35162 0.952744
C  -4.347614 0.447324 -0.219941
C  -4.093576 -0.107515 2.15805
C  -4.337464 1.594267 -1.002652
C  -5.176449 -0.622713 -0.53592
C  -5.182708 1.672115 -2.102805
C  -6.007561 -0.532011 -1.641081
C  -6.020177 0.61203 -2.423304
C  -4.844719 3.994436 -2.525764
C  -4.010322 4.731183 -3.352911
C  -5.346308 4.539547 -1.350736
C  -3.674608 6.030456 -2.998714
C  -4.989662 5.833968 -1.001754
C  -4.155949 6.584419 -1.820788
H  1.233215 -0.014745 -0.858557
H  -0.57955 -2.211826 0.376289
H  1.806054 -2.806511 0.31328
H  0.905236 -3.360044 -2.740628
H  0.447644 -3.774031 -1.086432
H  -0.791802 -3.521643 -2.302889
H  0.394448 -1.055633 -3.661133
H  -1.300155 -1.148009 -3.189747
H  -0.298329 0.203327 -2.653577
H  -2.973159 1.331182 1.183831
H  -3.672857 2.410234 -0.749728
H  -5.183118 -1.518695 0.072532
H  -6.661027 -1.355792 -1.894232
H  -6.673714 0.683489 -3.283256
H  -3.632712 4.293378 -4.268145
H  -6.007975 3.967837 -0.712308
H  -3.027518 6.606724 -3.646789
H  -5.374812 6.259105 -0.084383
H  -3.886652 7.594804 -1.543888
elementType: Br O N C H
nucrepener: 5501.28452809 hartree
twoeener: 9904.97593397 hartree
cpcmener: -0.03481823 hartree
xcener: -389.798156066048 hartree
chargesum: 0.0000000
charge: -0.083716 -0.014034 -0.012430 -0.002574 -0.272291 -0.461562 -0.333772 -0.100661 0.096692 -0.088166 -0.158465 -0.156294 -0.261747 -0.266217 0.423923 0.039711 0.417363 -0.013126 -0.220197 -0.178777 -0.220861 0.300590 -0.124727 -0.240693 0.297091 -0.252118 -0.209402 -0.121808 -0.137792 -0.188199 0.118379 0.120722 0.169349 0.098492 0.093481 0.109589 0.100712 0.105364 0.095105 0.138817 0.141985 0.145410 0.162627 0.150249 0.148980 0.160311 0.160852 0.162545 0.161290
qa: -0.0837 -0.0140 -0.0124 -0.0026 -0.2723 -0.4616 -0.3338 -0.1007 0.0967 -0.0882 -0.1585 -0.1563 -0.2617 -0.2662 0.4239 0.0397 0.4174 -0.0131 -0.2202 -0.1788 -0.2209 0.3006 -0.1247 -0.2407 0.2971 -0.2521 -0.2094 -0.1218 -0.1378 -0.1882 0.1184 0.1207 0.1693 0.0985 0.0935 0.1096 0.1007 0.1054 0.0951 0.1388 0.1420 0.1454 0.1626 0.1502 0.1490 0.1603 0.1609 0.1625 0.1613
va: 1.1811 1.2207 1.2271 1.2293 2.1338 2.0478 2.0772 3.1102 3.8652 3.7344 3.8941 4.0637 3.8998 3.8997 4.1230 4.3465 3.7232 3.6525 4.0732 3.9130 3.9911 3.7210 3.9100 4.0143 3.6625 4.0152 3.9260 3.8729 3.8761 3.9008 1.0444 1.0241 0.9931 1.0056 1.0040 1.0025 1.0026 0.9993 1.0178 1.0175 1.0196 1.0081 0.9885 1.0054 1.0070 0.9954 0.9883 0.9888 0.9895
dispcorr: -0.029014123 hartree
energy: -11427.159125913993
dipole: -158.48828 158.19318 -0.29510 53.68824 -54.07038 -0.38214 -66.59993 65.07432 -1.52561
magnitude: 1.60019 au
magnitude: 4.06736 debye
