program: Orca
programVersion: 5.0.2
elementType: Br Br Br Br O O O N C C C C C C C C C C C C C C C C C C C C C C H H H H H H H H H H H H H H H H H H H
charge: 0
multiplicity: 1
keywords: wb97x-d3
keywords: def2-TZVPP
keywords: def2/J RIJCOSX
keywords: DEFGRID2
keywords: scfconv7
keywords: smallprint printgap noloewdin
keywords: NOSOSCF
formula: C22H19Br4NO3
InChI: InChI=1/C22H19Br4NO3/c1-21(2)17(19(23)22(24,25)26)18(21)20(28)30-16(12-27)13-7-6-10-15(11-13)29-14-8-4-3-5-9-14/h3-11,16-19H,1-2H3
49 atoms
Br 4.02198 -1.547853 -0.836751
Br 3.202742 -0.032756 2.144745
Br 0.795874 -2.024565 2.464356
Br 3.710326 -3.134804 2.185923
O  -2.371787 -0.978862 -0.165011
O  -1.075994 0.830163 0.049188
O  -5.168744 4.130399 -1.213186
N  -5.458465 -1.858026 0.622118
C  0.741831 -0.955024 -1.867841
C  1.312123 -0.843534 -0.490001
C  -0.127208 -1.255521 -0.656781
C  2.299908 -1.828254 0.060695
C  1.055527 -2.141892 -2.745696
C  0.556846 0.322492 -2.647166
C  -1.19169 -0.338531 -0.219686
C  2.504671 -1.744981 1.58166
C  -3.501668 -0.18629 0.168952
C  -3.906631 0.75608 -0.941306
C  -4.581472 -1.141298 0.421919
C  -4.30658 2.04121 -0.614904
C  -3.899519 0.330113 -2.263882
C  -4.724785 2.904583 -1.618683
C  -4.305765 1.209314 -3.255332
C  -4.727906 2.494264 -2.945337
C  -5.020824 5.23395 -2.018407
C  -6.092577 6.111413 -2.085557
C  -3.832461 5.508456 -2.68303
C  -5.971009 7.280388 -2.823648
C  -3.730466 6.674565 -3.427948
C  -4.794248 7.564169 -3.502283
H  1.462065 0.179786 -0.160592
H  -0.360932 -2.307015 -0.532436
H  2.002566 -2.853867 -0.175031
H  1.969581 -1.970412 -3.314545
H  1.171429 -3.071599 -2.189256
H  0.245642 -2.292704 -3.460782
H  1.448349 0.512212 -3.246275
H  -0.289745 0.238789 -3.330217
H  0.399083 1.193559 -2.015532
H  -3.333501 0.368992 1.097856
H  -4.300646 2.374285 0.415971
H  -3.586764 -0.672588 -2.524925
H  -4.307265 0.888688 -4.288259
H  -5.056347 3.157125 -3.735008
H  -7.010235 5.88495 -1.557856
H  -2.991546 4.829352 -2.621068
H  -6.80598 7.966888 -2.871349
H  -2.806259 6.889765 -3.947761
H  -4.704646 8.472915 -4.082065
elementType: Br O N C H
nucrepener: 5436.61705457 hartree
twoeener: 9840.06038789 hartree
cpcmener: -0.03732309 hartree
xcener: -389.803147680749 hartree
chargesum: 0.0000000
charge: -0.082970 -0.013557 -0.012382 -0.001847 -0.276936 -0.449716 -0.334901 -0.100097 0.098336 -0.083310 -0.144454 -0.159805 -0.262520 -0.262751 0.392846 0.037148 0.416421 0.026102 -0.217476 -0.240563 -0.236955 0.282913 -0.136790 -0.183019 0.289491 -0.251044 -0.198497 -0.125613 -0.146027 -0.185415 0.116302 0.121572 0.170675 0.097811 0.093346 0.109849 0.102279 0.101504 0.095941 0.146391 0.137306 0.150509 0.163756 0.160008 0.148926 0.161293 0.161355 0.163028 0.161538
qa: -0.0830 -0.0136 -0.0124 -0.0018 -0.2769 -0.4497 -0.3349 -0.1001 0.0983 -0.0833 -0.1445 -0.1598 -0.2625 -0.2628 0.3928 0.0371 0.4164 0.0261 -0.2175 -0.2406 -0.2370 0.2829 -0.1368 -0.1830 0.2895 -0.2510 -0.1985 -0.1256 -0.1460 -0.1854 0.1163 0.1216 0.1707 0.0978 0.0933 0.1098 0.1023 0.1015 0.0959 0.1464 0.1373 0.1505 0.1638 0.1600 0.1489 0.1613 0.1614 0.1630 0.1615
va: 1.1826 1.2217 1.2267 1.2303 2.1238 2.0591 2.0692 3.1110 3.8678 3.7383 3.8605 4.0649 3.8989 3.8980 4.1527 4.3543 3.6985 3.6108 4.0826 4.0891 3.9573 3.7440 3.9087 3.9118 3.6671 4.0085 3.9156 3.8792 3.8836 3.8983 1.0460 1.0242 0.9926 1.0061 1.0036 1.0023 1.0034 1.0013 1.0164 1.0167 1.0179 1.0120 0.9893 0.9943 1.0072 0.9956 0.9881 0.9891 0.9894
dispcorr: -0.029131508 hartree
energy: -11427.158759469788
dipole: -143.35761 143.98693 0.62932 90.15813 -89.65247 0.50566 -95.09257 92.91686 -2.17571
magnitude: 2.32066 au
magnitude: 5.89865 debye
