program: Orca
programVersion: 5.0.2
elementType: Br Br Br Br O O O N C C C C C C C C C C C C C C C C C C C C C C H H H H H H H H H H H H H H H H H H H
charge: 0
multiplicity: 1
keywords: wb97x-d3
keywords: def2-TZVPP
keywords: def2/J RIJCOSX
keywords: DEFGRID2
keywords: scfconv7
keywords: smallprint printgap noloewdin
keywords: NOSOSCF
formula: C22H19Br4NO3
InChI: InChI=1/C22H19Br4NO3/c1-21(2)17(19(23)22(24,25)26)18(21)20(28)30-16(12-27)13-7-6-10-15(11-13)29-14-8-4-3-5-9-14/h3-11,16-19H,1-2H3
49 atoms
Br 4.013244 -1.801926 -0.834098
Br 3.311157 -0.301383 2.202672
Br 0.811002 -2.16784 2.510841
Br 3.651635 -3.424196 2.161552
O  -2.323296 -0.675984 -0.131618
O  -0.826949 0.956333 0.168173
O  -4.156274 4.784468 -1.355394
N  -5.523995 -1.183647 0.466703
C  0.748789 -1.004952 -1.800935
C  1.361822 -0.933017 -0.437164
C  -0.111884 -1.211302 -0.564469
C  2.288199 -1.991649 0.083973
C  0.928802 -2.224542 -2.671625
C  0.657501 0.27539 -2.593482
C  -1.073955 -0.184061 -0.131396
C  2.516282 -1.957498 1.603835
C  -3.365613 0.251965 0.139347
C  -3.574356 1.233477 -0.992089
C  -4.564266 -0.567645 0.31937
C  -3.791718 2.568709 -0.692718
C  -3.569266 0.794858 -2.310828
C  -4.001051 3.477055 -1.722099
C  -3.768048 1.716026 -3.327135
C  -3.982653 3.058009 -3.046048
C  -4.929532 5.628548 -2.117616
C  -4.418393 6.888994 -2.386716
C  -6.200067 5.266444 -2.546979
C  -5.191832 7.799632 -3.093538
C  -6.955876 6.181899 -3.264751
C  -6.458124 7.44923 -3.540229
H  1.611414 0.075292 -0.122334
H  -0.446615 -2.233329 -0.426311
H  1.920512 -2.990779 -0.164693
H  1.847281 -2.150246 -3.254485
H  0.957332 -3.157177 -2.108908
H  0.097635 -2.297514 -3.374447
H  0.597579 1.164737 -1.97001
H  1.544219 0.376886 -3.220875
H  -0.213823 0.260746 -3.250573
H  -3.187242 0.785241 1.079079
H  -3.793337 2.907767 0.336202
H  -3.409086 -0.248248 -2.551386
H  -3.754869 1.388757 -4.357981
H  -4.126121 3.760728 -3.85639
H  -3.427918 7.156012 -2.041043
H  -6.601386 4.285682 -2.324224
H  -4.795441 8.78504 -3.300176
H  -7.944759 5.901971 -3.603296
H  -7.055271 8.15917 -4.096567
elementType: Br O N C H
nucrepener: 5412.04844581 hartree
twoeener: 9815.74330941 hartree
cpcmener: -0.03741618 hartree
xcener: -389.799599400274 hartree
chargesum: -0.0000000
charge: -0.082537 -0.013733 -0.011677 -0.002443 -0.273801 -0.447260 -0.336289 -0.099911 0.103957 -0.089072 -0.147953 -0.155604 -0.262999 -0.264534 0.387774 0.034805 0.421252 0.039158 -0.221239 -0.244880 -0.248565 0.276673 -0.136258 -0.175051 0.275434 -0.242667 -0.188995 -0.129579 -0.148162 -0.181341 0.116192 0.122992 0.169424 0.098026 0.094582 0.109245 0.096253 0.103347 0.101171 0.144195 0.137400 0.151483 0.163926 0.160130 0.149252 0.162002 0.161679 0.162521 0.161676
qa: -0.0825 -0.0137 -0.0117 -0.0024 -0.2738 -0.4473 -0.3363 -0.0999 0.1040 -0.0891 -0.1480 -0.1556 -0.2630 -0.2645 0.3878 0.0348 0.4213 0.0392 -0.2212 -0.2449 -0.2486 0.2767 -0.1363 -0.1751 0.2754 -0.2427 -0.1890 -0.1296 -0.1482 -0.1813 0.1162 0.1230 0.1694 0.0980 0.0946 0.1092 0.0963 0.1033 0.1012 0.1442 0.1374 0.1515 0.1639 0.1601 0.1493 0.1620 0.1617 0.1625 0.1617
va: 1.1825 1.2211 1.2261 1.2297 2.1273 2.0620 2.0648 3.1106 3.8663 3.7496 3.8615 4.0606 3.8979 3.8972 4.1781 4.3536 3.6957 3.5942 4.0848 4.0859 3.9554 3.7439 3.9074 3.9081 3.6767 4.0063 3.9137 3.8805 3.8856 3.8937 1.0453 1.0226 0.9934 1.0059 1.0036 1.0025 1.0156 1.0039 1.0014 1.0169 1.0179 1.0118 0.9894 0.9948 1.0065 0.9946 0.9880 0.9892 0.9891
dispcorr: -0.029350365 hartree
energy: -11427.158989384137
dipole: -146.78695 146.89267 0.10572 101.25721 -100.95464 0.30257 -95.97565 93.85464 -2.12101
magnitude: 2.14509 au
magnitude: 5.45238 debye
