program: Orca
programVersion: 5.0.2
elementType: Cl Cl F F F F O O C C C C C C C C C C C C C C C H H H H H H H H H H H H
charge: 0
multiplicity: 1
keywords: wb97x-d3
keywords: def2-TZVPP
keywords: def2/J RIJCOSX
keywords: DEFGRID2
keywords: scfconv7
keywords: smallprint printgap noloewdin
keywords: NOSOSCF
formula: C15H12Cl2F4O2
InChI: InChI=1/C15H12Cl2F4O2/c1-15(2)7(3-10(16)17)11(15)14(22)23-5-6-12(20)8(18)4-9(19)13(6)21/h3-4,7,11H,5H2,1-2H3
35 atoms
Cl -4.980171 0.667982 2.072837
Cl -5.41102 2.554636 -0.066658
F  2.21081 1.206803 1.632169
F  3.624783 -2.283927 -1.177841
F  5.661316 -0.762215 -2.038481
F  4.250598 2.726924 0.765081
O  0.594724 -1.047167 -0.061969
O  -0.754264 -2.110762 1.367564
C  -2.829083 -1.883131 -0.958702
C  -1.67133 -0.998973 -0.544719
C  -3.061644 -0.773557 0.023561
C  -2.946063 -3.30199 -0.456974
C  -3.299482 -1.728594 -2.386491
C  -3.786258 0.451844 -0.333336
C  -0.602944 -1.459491 0.369307
C  -4.611126 1.125331 0.459664
C  1.719459 -1.407329 0.737915
C  2.87306 -0.580552 0.259199
C  3.053452 0.712467 0.729575
C  3.766925 -1.054484 -0.688677
C  4.817588 -0.271872 -1.13505
C  4.102039 1.496311 0.284781
C  4.990928 1.009066 -0.652381
H  -1.338635 -0.294607 -1.298685
H  -3.17663 -1.099567 1.051049
H  -2.319286 -3.972933 -1.046896
H  -2.664731 -3.411219 0.58653
H  -3.978604 -3.63828 -0.562337
H  -4.367907 -1.936211 -2.46268
H  -3.125197 -0.732818 -2.792285
H  -2.776297 -2.434342 -3.032827
H  -3.641961 0.85785 -1.326826
H  1.928837 -2.472749 0.635407
H  1.51987 -1.218008 1.7930
H  5.811149 1.621414 -1.001586
totalener: -2049.15315793 hartree
nucrepener: 2168.72254027 hartree
electener: -4217.87569821 hartree
oneelecener: -7133.54453499 hartree
twoeener: 2915.66883678 hartree
kineticenergy: 2043.56984971 hartree
xcener: -143.165045260966 hartree
chargesum: -0.0000000
charge: -0.038819 -0.047484 -0.183356 -0.185474 -0.181606 -0.180682 -0.259170 -0.381717 0.068983 -0.087072 0.043605 -0.249903 -0.246655 -0.200363 0.347672 0.050736 0.060597 -0.208228 0.262919 0.267303 0.164650 0.172241 -0.155905 0.076395 0.087299 0.085036 0.105288 0.089150 0.099731 0.073622 0.093518 0.094973 0.114977 0.114299 0.133438
qa: -0.0388 -0.0475 -0.1834 -0.1855 -0.1816 -0.1807 -0.2592 -0.3817 0.0690 -0.0871 0.0436 -0.2499 -0.2467 -0.2004 0.3477 0.0507 0.0606 -0.2082 0.2629 0.2673 0.1647 0.1722 -0.1559 0.0764 0.0873 0.0850 0.1053 0.0892 0.0997 0.0736 0.0935 0.0950 0.1150 0.1143 0.1334
va: 1.2888 1.2573 1.1232 1.1209 1.1135 1.1145 2.1313 2.1176 3.7554 3.8912 3.8239 3.9136 3.9106 3.9229 4.2239 4.2505 3.8389 3.7156 3.8795 3.8745 4.0020 4.0022 3.8528 1.0352 1.0494 1.0022 1.0220 1.0008 1.0024 1.0098 1.0045 1.0320 1.0062 1.0087 1.0071
dispcorr: -0.015734240 hartree
energy: -2049.168892172856
dipole: -16.86483 17.35244 0.48760 -22.20894 21.97550 -0.23344 -10.99061 10.09377 -0.89685
magnitude: 1.04718 au
magnitude: 2.66172 debye
