program: Orca
programVersion: 5.0.2
elementType: Cl Cl F F F F O O C C C C C C C C C C C C C C C H H H H H H H H H H H H
charge: 0
multiplicity: 1
keywords: wb97x-d3
keywords: def2-TZVPP
keywords: def2/J RIJCOSX
keywords: DEFGRID2
keywords: scfconv7
keywords: smallprint printgap noloewdin
keywords: NOSOSCF
formula: C15H12Cl2F4O2
InChI: InChI=1/C15H12Cl2F4O2/c1-15(2)7(3-10(16)17)11(15)14(22)23-5-6-12(20)8(18)4-9(19)13(6)21/h3-4,7,11H,5H2,1-2H3
35 atoms
Cl -3.749262 1.870829 -0.58942
Cl -5.937952 0.456287 -1.834515
F  3.421206 2.585637 -0.842754
F  2.106201 -1.202888 1.607249
F  4.353439 -2.470117 0.85222
F  5.664251 1.322314 -1.579692
O  0.346239 0.665852 0.187149
O  -0.791097 0.489553 2.115314
C  -2.014675 -1.974016 0.571485
C  -1.603054 -0.576555 0.136078
C  -2.988913 -0.846118 0.662921
C  -1.468227 -2.576782 1.842328
C  -2.167112 -2.97583 -0.547846
C  -4.155867 -0.751756 -0.242072
C  -0.673624 0.238391 0.947515
C  -4.557477 0.37486 -0.815241
C  1.412113 1.372424 0.81056
C  2.700544 0.718829 0.401089
C  3.631395 1.342746 -0.413572
C  2.974848 -0.57663 0.817508
C  4.131367 -1.227261 0.434788
C  4.794951 0.694112 -0.794635
C  5.052755 -0.593951 -0.376225
H  -1.501933 -0.443797 -0.934994
H  -3.162181 -0.464241 1.666193
H  -2.097289 -3.413798 2.150806
H  -0.459472 -2.962627 1.685815
H  -1.431855 -1.868691 2.666478
H  -2.865417 -3.766322 -0.26491
H  -2.532709 -2.522789 -1.469878
H  -1.209156 -3.448045 -0.769776
H  -4.741682 -1.64413 -0.429818
H  1.30324 1.364473 1.895715
H  1.378013 2.40989 0.480842
H  5.96092 -1.097845 -0.677705
totalener: -2049.15006874 hartree
nucrepener: 2236.63983520 hartree
electener: -4285.78990395 hartree
oneelecener: -7269.60676328 hartree
twoeener: 2983.81685933 hartree
kineticenergy: 2043.57733325 hartree
xcener: -143.166708365952 hartree
chargesum: -0.0000000
charge: -0.033158 -0.042844 -0.186570 -0.184561 -0.181994 -0.181618 -0.266688 -0.375396 0.114522 -0.145175 -0.020152 -0.250756 -0.272412 -0.239058 0.370478 0.086981 0.043897 -0.150260 0.231767 0.236511 0.182068 0.185054 -0.170327 0.100683 0.110299 0.085805 0.089209 0.102403 0.092599 0.087101 0.095952 0.117840 0.129836 0.104977 0.132985
qa: -0.0332 -0.0428 -0.1866 -0.1846 -0.1820 -0.1816 -0.2667 -0.3754 0.1145 -0.1452 -0.0202 -0.2508 -0.2724 -0.2391 0.3705 0.0870 0.0439 -0.1503 0.2318 0.2365 0.1821 0.1851 -0.1703 0.1007 0.1103 0.0858 0.0892 0.1024 0.0926 0.0871 0.0960 0.1178 0.1298 0.1050 0.1330
va: 1.2987 1.2633 1.1177 1.1214 1.1133 1.1139 2.1118 2.1295 3.7334 3.8699 3.8450 3.8993 3.9135 3.9051 4.1817 4.2068 3.8528 3.6540 3.9077 3.8717 4.0159 3.9903 3.8690 1.0260 1.0270 1.0032 1.0071 1.0198 1.0015 1.0005 1.0064 1.0164 1.0193 1.0093 1.0073
dispcorr: -0.017581183 hartree
energy: -2049.167649924975
dipole: -11.98811 12.38868 0.40057 -20.06581 19.28445 -0.78136 8.89552 -9.14008 -0.24456
magnitude: 0.91147 au
magnitude: 2.31678 debye
