program: Orca
programVersion: 5.0.2
elementType: Cl Cl F F F F O O C C C C C C C C C C C C C C C H H H H H H H H H H H H
charge: 0
multiplicity: 1
keywords: wb97x-d3
keywords: def2-TZVPP
keywords: def2/J RIJCOSX
keywords: DEFGRID2
keywords: scfconv7
keywords: smallprint printgap noloewdin
keywords: NOSOSCF
formula: C15H12Cl2F4O2
InChI: InChI=1/C15H12Cl2F4O2/c1-15(2)7(3-10(16)17)11(15)14(22)23-5-6-12(20)8(18)4-9(19)13(6)21/h3-4,7,11H,5H2,1-2H3
35 atoms
Cl -2.967022 0.661307 2.480792
Cl -4.987984 1.594971 0.647013
F  3.941882 -1.432153 0.345701
F  1.477891 1.74849 -2.083114
F  2.22717 3.652785 -0.337307
F  4.704516 0.47523 2.061875
O  0.823854 -1.076725 -1.945024
O  0.791585 -1.817405 0.163261
C  -2.148495 -2.642788 -0.51683
C  -1.257479 -1.541296 -1.048606
C  -2.163423 -1.299173 0.148284
C  -1.570666 -3.803389 0.256502
C  -3.293154 -3.051575 -1.414199
C  -3.276198 -0.353344 0.005056
C  0.205947 -1.513165 -0.84048
C  -3.680731 0.513074 0.925912
C  2.238067 -0.949419 -1.884103
C  2.681796 0.107463 -0.91107
C  3.505783 -0.190816 0.162712
C  2.262155 1.421725 -1.05922
C  2.648163 2.402938 -0.16496
C  3.902229 0.793499 1.050603
C  3.472176 2.094887 0.897925
H  -1.579113 -1.101393 -1.985735
H  -1.639665 -1.262413 1.096549
H  -0.796618 -3.505355 0.957787
H  -2.365343 -4.292897 0.821609
H  -1.142907 -4.545113 -0.420353
H  -4.135044 -3.413988 -0.82243
H  -3.655653 -2.242378 -2.046932
H  -2.97989 -3.859845 -2.07635
H  -3.814098 -0.337256 -0.934634
H  2.535439 -0.680043 -2.896936
H  2.699902 -1.906819 -1.643263
H  3.777822 2.861099 1.597076
totalener: -2049.15137860 hartree
nucrepener: 2263.63078766 hartree
electener: -4312.78216626 hartree
oneelecener: -7323.83545377 hartree
twoeener: 3011.05328751 hartree
kineticenergy: 2043.59128409 hartree
xcener: -143.171066111102 hartree
chargesum: 0.0000000
charge: -0.039652 -0.046231 -0.185511 -0.182645 -0.183763 -0.183519 -0.263495 -0.382831 0.071933 -0.082107 0.032898 -0.243575 -0.251896 -0.198828 0.351704 0.050511 0.065767 -0.187865 0.301063 0.195748 0.181683 0.179764 -0.174681 0.079970 0.087168 0.103745 0.087670 0.084809 0.099913 0.074914 0.092928 0.095256 0.121878 0.116021 0.131254
qa: -0.0397 -0.0462 -0.1855 -0.1826 -0.1838 -0.1835 -0.2635 -0.3828 0.0719 -0.0821 0.0329 -0.2436 -0.2519 -0.1988 0.3517 0.0505 0.0658 -0.1879 0.3011 0.1957 0.1817 0.1798 -0.1747 0.0800 0.0872 0.1037 0.0877 0.0848 0.0999 0.0749 0.0929 0.0953 0.1219 0.1160 0.1313
va: 1.2880 1.2588 1.1202 1.1209 1.1116 1.1120 2.1319 2.1211 3.7561 3.8389 3.8389 3.9121 3.9126 3.9234 4.2241 4.2535 3.8667 3.6342 3.8320 3.9453 3.9869 3.9989 3.8705 1.0361 1.0496 1.0235 1.0007 1.0026 1.0023 1.0095 1.0042 1.0326 0.9900 1.0188 1.0079
dispcorr: -0.016894388 hartree
energy: -2049.168272987514
dipole: -13.12904 13.06021 -0.06883 -29.93989 29.36070 -0.57919 -12.32634 11.39793 -0.92841
magnitude: 1.09642 au
magnitude: 2.78688 debye
