program: Orca
programVersion: 5.0.2
elementType: Cl Cl F F F F O O C C C C C C C C C C C C C C C H H H H H H H H H H H H
charge: 0
multiplicity: 1
keywords: wb97x-d3
keywords: def2-TZVPP
keywords: def2/J RIJCOSX
keywords: DEFGRID2
keywords: scfconv7
keywords: smallprint printgap noloewdin
keywords: NOSOSCF
formula: C15H12Cl2F4O2
InChI: InChI=1/C15H12Cl2F4O2/c1-15(2)7(3-10(16)17)11(15)14(22)23-5-6-12(20)8(18)4-9(19)13(6)21/h3-4,7,11H,5H2,1-2H3
35 atoms
Cl -3.225141 0.463932 2.58855
Cl -5.074244 1.560166 0.664635
F  3.908691 -1.461377 0.429479
F  1.62432 1.705466 -2.186261
F  2.385216 3.64721 -0.484075
F  4.671616 0.477804 2.109164
O  0.854445 -1.100949 -1.921832
O  0.791855 -1.767784 0.210262
C  -2.144241 -2.588404 -0.494705
C  -1.243055 -1.492931 -1.023613
C  -2.15638 -1.239699 0.162358
C  -1.578484 -3.746987 0.290181
C  -3.28724 -2.993511 -1.39545
C  -3.268698 -0.29454 0.004688
C  0.219922 -1.484437 -0.807224
C  -3.780864 0.467007 0.963884
C  2.272092 -1.007654 -1.856369
C  2.734149 0.070276 -0.915813
C  3.516987 -0.214993 0.192033
C  2.365387 1.391465 -1.126004
C  2.757745 2.391083 -0.255023
C  3.916645 0.786498 1.058935
C  3.536245 2.094879 0.845218
H  -1.553175 -1.05867 -1.967487
H  -1.644465 -1.202124 1.117067
H  -2.37979 -4.226943 0.854278
H  -1.151633 -4.49673 -0.37855
H  -0.806943 -3.448668 0.994332
H  -2.976447 -3.805302 -2.054738
H  -4.132896 -3.349474 -0.805086
H  -3.643984 -2.182911 -2.029611
H  -3.713202 -0.190044 -0.977292
H  2.581601 -0.780669 -2.875615
H  2.70761 -1.967491 -1.579869
H  3.844549 2.876306 1.526205
totalener: -2049.15152366 hartree
nucrepener: 2255.54781689 hartree
electener: -4304.69934055 hartree
oneelecener: -7307.64936971 hartree
twoeener: 3002.95002915 hartree
kineticenergy: 2043.58624962 hartree
xcener: -143.170028431033 hartree
chargesum: -0.0000000
charge: -0.039679 -0.046163 -0.184876 -0.183060 -0.183910 -0.183397 -0.263252 -0.383315 0.068520 -0.089592 0.040662 -0.244615 -0.243923 -0.201661 0.353090 0.049761 0.065645 -0.190633 0.302392 0.195249 0.182666 0.180832 -0.175173 0.079238 0.087526 0.088047 0.084954 0.103774 0.093008 0.099147 0.073228 0.095935 0.122577 0.115628 0.131370
qa: -0.0397 -0.0462 -0.1849 -0.1831 -0.1839 -0.1834 -0.2633 -0.3833 0.0685 -0.0896 0.0407 -0.2446 -0.2439 -0.2017 0.3531 0.0498 0.0656 -0.1906 0.3024 0.1952 0.1827 0.1808 -0.1752 0.0792 0.0875 0.0880 0.0850 0.1038 0.0930 0.0991 0.0732 0.0959 0.1226 0.1156 0.1314
va: 1.2878 1.2589 1.1211 1.1208 1.1111 1.1124 2.1329 2.1203 3.7535 3.8510 3.8298 3.9127 3.9112 3.9197 4.2234 4.2496 3.8660 3.6349 3.8292 3.9456 3.9833 4.0000 3.8712 1.0368 1.0490 1.0009 1.0024 1.0233 1.0042 1.0030 1.0097 1.0311 0.9900 1.0186 1.0078
dispcorr: -0.016873479 hartree
energy: -2049.168397139319
dipole: -12.63595 12.61498 -0.02097 -29.04013 28.47982 -0.56031 -12.26886 11.33220 -0.93665
magnitude: 1.09165 au
magnitude: 2.77476 debye
