program: Orca
programVersion: 5.0.2
elementType: Cl Cl F F F F O O C C C C C C C C C C C C C C C H H H H H H H H H H H H
charge: 0
multiplicity: 1
keywords: wb97x-d3
keywords: def2-TZVPP
keywords: def2/J RIJCOSX
keywords: DEFGRID2
keywords: scfconv7
keywords: smallprint printgap noloewdin
keywords: NOSOSCF
formula: C15H12Cl2F4O2
InChI: InChI=1/C15H12Cl2F4O2/c1-15(2)7(3-10(16)17)11(15)14(22)23-5-6-12(20)8(18)4-9(19)13(6)21/h3-4,7,11H,5H2,1-2H3
35 atoms
Cl -1.572262 1.852418 0.32409
Cl -4.117059 2.879982 -0.574703
F  1.105749 0.658377 1.391993
F  4.040783 -1.992444 -1.144375
F  5.4923 0.185603 -1.726092
F  2.53095 2.843012 0.760172
O  0.383298 -1.718669 -0.083421
O  -0.623533 -2.09877 1.886271
C  -3.21956 -2.175116 0.148973
C  -1.911222 -1.418823 -0.009806
C  -3.064597 -0.826303 0.767443
C  -3.318707 -3.384039 1.045997
C  -4.045453 -2.296488 -1.109868
C  -3.787785 0.352739 0.241782
C  -0.683218 -1.785975 0.728548
C  -3.229486 1.53612 0.025457
C  1.677674 -1.913009 0.474357
C  2.525388 -0.720819 0.133229
C  2.1731 0.53443 0.608726
C  3.655402 -0.811527 -0.663262
C  4.406842 0.311707 -0.968658
C  2.910551 1.658293 0.292063
C  4.037252 1.55423 -0.499336
H  -1.733736 -1.009583 -0.997401
H  -2.91627 -0.825461 1.844746
H  -2.760379 -3.272599 1.971419
H  -4.364228 -3.56076 1.304905
H  -2.951793 -4.276552 0.536101
H  -5.103373 -2.411532 -0.86493
H  -3.948038 -1.42836 -1.762228
H  -3.743981 -3.174973 -1.681888
H  -4.849155 0.259388 0.042534
H  2.098216 -2.822246 0.047424
H  1.619875 -2.047835 1.555213
H  4.621333 2.430758 -0.744277
totalener: -2049.14907049 hartree
nucrepener: 2302.24025954 hartree
electener: -4351.38933003 hartree
oneelecener: -7401.00733821 hartree
twoeener: 3049.61800818 hartree
kineticenergy: 2043.58481673 hartree
xcener: -143.168424684009 hartree
chargesum: -0.0000000
charge: -0.032477 -0.045029 -0.183432 -0.188218 -0.182104 -0.180855 -0.267758 -0.381511 0.119824 -0.156807 -0.015702 -0.253774 -0.268919 -0.252036 0.375742 0.100321 0.049817 -0.135582 0.226153 0.223176 0.188714 0.185969 -0.172198 0.105100 0.108805 0.105128 0.084694 0.086419 0.092334 0.088151 0.094913 0.116705 0.103643 0.128208 0.132585
qa: -0.0325 -0.0450 -0.1834 -0.1882 -0.1821 -0.1809 -0.2678 -0.3815 0.1198 -0.1568 -0.0157 -0.2538 -0.2689 -0.2520 0.3757 0.1003 0.0498 -0.1356 0.2262 0.2232 0.1887 0.1860 -0.1722 0.1051 0.1088 0.1051 0.0847 0.0864 0.0923 0.0882 0.0949 0.1167 0.1036 0.1282 0.1326
va: 1.3168 1.2603 1.1241 1.1150 1.1129 1.1154 2.1154 2.1214 3.7126 3.8812 3.8429 3.9020 3.9136 3.9111 4.1792 4.2020 3.8553 3.6476 3.8673 3.9083 3.9890 4.0241 3.8688 1.0266 1.0271 1.0217 1.0022 1.0019 1.0015 1.0005 1.0062 1.0177 1.0088 1.0204 1.0075
dispcorr: -0.018107675 hartree
energy: -2049.167178167818
dipole: -27.08795 26.83744 -0.25051 -28.80031 28.31708 -0.48323 1.91022 -2.35373 -0.44351
magnitude: 0.70211 au
magnitude: 1.78463 debye
