program: Orca
programVersion: 5.0.2
elementType: Cl Cl F F F F O O C C C C C C C C C C C C C C C H H H H H H H H H H H H
charge: 0
multiplicity: 1
keywords: wb97x-d3
keywords: def2-TZVPP
keywords: def2/J RIJCOSX
keywords: DEFGRID2
keywords: scfconv7
keywords: smallprint printgap noloewdin
keywords: NOSOSCF
formula: C15H12Cl2F4O2
InChI: InChI=1/C15H12Cl2F4O2/c1-15(2)7(3-10(16)17)11(15)14(22)23-5-6-12(20)8(18)4-9(19)13(6)21/h3-4,7,11H,5H2,1-2H3
35 atoms
Cl -2.701404 0.664516 2.400401
Cl -4.867506 1.568294 0.725309
F  3.998756 -1.398317 -0.079847
F  1.209964 1.985524 -1.775976
F  1.896684 3.571851 0.280967
F  4.698606 0.196345 1.950233
O  0.745177 -0.867202 -2.12383
O  0.868536 -1.921609 -0.156978
C  -2.110394 -2.676077 -0.641999
C  -1.258075 -1.563557 -1.205511
C  -2.100564 -1.34388 0.045661
C  -1.490002 -3.845567 0.0844
C  -3.298436 -3.080247 -1.484214
C  -3.219136 -0.397347 -0.02147
C  0.21266 -1.500728 -1.071075
C  -3.542919 0.487956 0.913764
C  2.149531 -0.648813 -2.104818
C  2.575847 0.247261 -0.975292
C  3.469546 -0.182092 -0.006849
C  2.060558 1.530271 -0.858683
C  2.416604 2.350643 0.195906
C  3.835441 0.642756 1.041589
C  3.308446 1.912681 1.15384
H  -1.636401 -1.103277 -2.111137
H  -1.525082 -1.318627 0.963923
H  -0.692289 -3.553658 0.760866
H  -1.080094 -4.567845 -0.623628
H  -2.258204 -4.355357 0.66819
H  -3.698328 -2.265854 -2.087443
H  -3.014014 -3.877758 -2.172098
H  -4.106223 -3.456778 -0.854788
H  -3.832926 -0.395394 -0.913674
H  2.369609 -0.18251 -3.06436
H  2.685525 -1.596709 -2.062284
H  3.589188 2.555227 1.977135
totalener: -2049.15070449 hartree
nucrepener: 2281.31397825 hartree
electener: -4330.46468275 hartree
oneelecener: -7359.22964081 hartree
twoeener: 3028.76495806 hartree
kineticenergy: 2043.58418654 hartree
xcener: -143.169792961805 hartree
chargesum: -0.0000000
charge: -0.040241 -0.045811 -0.186053 -0.182464 -0.183467 -0.183773 -0.263821 -0.383233 0.084498 -0.080601 0.018943 -0.241707 -0.255498 -0.193168 0.350304 0.049360 0.067710 -0.190032 0.301036 0.195523 0.182583 0.181190 -0.175204 0.079405 0.087796 0.103550 0.085077 0.086457 0.075034 0.093242 0.100050 0.095470 0.121972 0.114648 0.131228
qa: -0.0402 -0.0458 -0.1861 -0.1825 -0.1835 -0.1838 -0.2638 -0.3832 0.0845 -0.0806 0.0189 -0.2417 -0.2555 -0.1932 0.3503 0.0494 0.0677 -0.1900 0.3010 0.1955 0.1826 0.1812 -0.1752 0.0794 0.0878 0.1036 0.0851 0.0865 0.0750 0.0932 0.1001 0.0955 0.1220 0.1146 0.1312
va: 1.2879 1.2593 1.1197 1.1212 1.1119 1.1118 2.1314 2.1186 3.7461 3.8398 3.8611 3.9079 3.9138 3.9219 4.2178 4.2536 3.8641 3.6376 3.8282 3.9455 3.9856 3.9992 3.8718 1.0367 1.0480 1.0247 1.0031 1.0004 1.0092 1.0042 1.0021 1.0324 0.9902 1.0189 1.0079
dispcorr: -0.017095670 hartree
energy: -2049.167800164763
dipole: -13.19738 13.05135 -0.14603 -29.64935 29.16360 -0.48575 -13.67378 12.77396 -0.89981
magnitude: 1.03293 au
magnitude: 2.62549 debye
