program: Orca
programVersion: 5.0.2
elementType: Cl Cl F F F F O O C C C C C C C C C C C C C C C H H H H H H H H H H H H
charge: 0
multiplicity: 1
keywords: wb97x-d3
keywords: def2-TZVPP
keywords: def2/J RIJCOSX
keywords: DEFGRID2
keywords: scfconv7
keywords: smallprint printgap noloewdin
keywords: NOSOSCF
formula: C15H12Cl2F4O2
InChI: InChI=1/C15H12Cl2F4O2/c1-15(2)7(3-10(16)17)11(15)14(22)23-5-6-12(20)8(18)4-9(19)13(6)21/h3-4,7,11H,5H2,1-2H3
35 atoms
Cl -1.381502 1.757257 0.337059
Cl -3.833559 2.914262 -0.656394
F  1.280094 0.479428 1.738285
F  3.750281 -1.784277 -1.559813
F  5.099025 0.464356 -2.086351
F  2.620949 2.735956 1.191476
O  0.374158 -1.772762 -0.104066
O  -0.589029 -2.17628 1.884255
C  -3.24687 -2.177263 0.241995
C  -1.913552 -1.490092 0.013091
C  -3.019077 -0.808681 0.789639
C  -3.371882 -3.333737 1.203385
C  -4.107004 -2.328556 -0.990208
C  -3.676767 0.387628 0.219071
C  -0.674196 -1.857876 0.73011
C  -3.047351 1.533694 -0.003986
C  1.685744 -1.950453 0.417281
C  2.48245 -0.714409 0.113148
C  2.217116 0.46508 0.794992
C  3.461913 -0.684309 -0.866639
C  4.161035 0.478467 -1.144127
C  2.907564 1.62813 0.514988
C  3.888104 1.642822 -0.457584
H  -1.75166 -1.128832 -0.995647
H  -2.843204 -0.763139 1.861776
H  -4.420059 -3.469783 1.475362
H  -3.028848 -4.261072 0.741517
H  -2.804865 -3.186486 2.118393
H  -3.857243 -3.249595 -1.518756
H  -5.163125 -2.382197 -0.718265
H  -3.985712 -1.503104 -1.692343
H  -4.735105 0.342604 -0.010307
H  2.124294 -2.822778 -0.064755
H  1.658233 -2.13943 1.490636
H  4.431372 2.551558 -0.677839
totalener: -2049.14899819 hartree
nucrepener: 2312.91285728 hartree
electener: -4362.06185546 hartree
oneelecener: -7422.34500934 hartree
twoeener: 3060.28315388 hartree
kineticenergy: 2043.58602488 hartree
xcener: -143.168019168678 hartree
chargesum: 0.0000000
charge: -0.036062 -0.043239 -0.178074 -0.187731 -0.182265 -0.180798 -0.264845 -0.378709 0.124737 -0.154434 -0.025935 -0.252810 -0.269577 -0.248701 0.369497 0.101918 0.050380 -0.146108 0.222543 0.226651 0.180576 0.190370 -0.166802 0.104599 0.111621 0.083913 0.086996 0.104425 0.095024 0.092709 0.086919 0.117942 0.102767 0.129617 0.132886
qa: -0.0361 -0.0432 -0.1781 -0.1877 -0.1823 -0.1808 -0.2648 -0.3787 0.1247 -0.1544 -0.0259 -0.2528 -0.2696 -0.2487 0.3695 0.1019 0.0504 -0.1461 0.2225 0.2267 0.1806 0.1904 -0.1668 0.1046 0.1116 0.0839 0.0870 0.1044 0.0950 0.0927 0.0869 0.1179 0.1028 0.1296 0.1329
va: 1.3131 1.2628 1.1281 1.1169 1.1127 1.1154 2.1142 2.1240 3.7103 3.8779 3.8539 3.9020 3.9137 3.9157 4.1826 4.1976 3.8487 3.6581 3.8539 3.9176 3.9885 4.0156 3.8663 1.0271 1.0249 1.0022 1.0019 1.0223 1.0062 1.0012 1.0009 1.0166 1.0072 1.0204 1.0072
dispcorr: -0.018334297 hartree
energy: -2049.167332484034
dipole: -27.71604 27.40167 -0.31438 -28.81061 28.36563 -0.44498 2.68104 -3.11211 -0.43106
magnitude: 0.69473 au
magnitude: 1.76587 debye
