program: Orca
programVersion: 5.0.2
elementType: Cl Cl F F F F O O C C C C C C C C C C C C C C C H H H H H H H H H H H H
charge: 0
multiplicity: 1
keywords: wb97x-d3
keywords: def2-TZVPP
keywords: def2/J RIJCOSX
keywords: DEFGRID2
keywords: scfconv7
keywords: smallprint printgap noloewdin
keywords: NOSOSCF
formula: C15H12Cl2F4O2
InChI: InChI=1/C15H12Cl2F4O2/c1-15(2)7(3-10(16)17)11(15)14(22)23-5-6-12(20)8(18)4-9(19)13(6)21/h3-4,7,11H,5H2,1-2H3
35 atoms
Cl -5.444157 -0.295734 -1.638789
Cl -5.760431 -2.453688 0.247992
F  3.417552 2.301098 0.874453
F  2.807979 -1.69155 -1.52215
F  5.154735 -2.604761 -0.587697
F  5.767368 1.383897 1.80148
O  0.730666 0.539192 -0.052392
O  -0.681098 1.612282 -1.408978
C  -2.531882 1.51655 1.12323
C  -1.512481 0.544761 0.562618
C  -2.955917 0.497585 0.106345
C  -2.527987 2.967555 0.707411
C  -2.904319 1.320129 2.573926
C  -3.786283 -0.663398 0.451662
C  -0.484019 0.969005 -0.413068
C  -4.85099 -1.074048 -0.226852
C  1.792415 0.883812 -0.93977
C  3.065959 0.340087 -0.369027
C  3.835201 1.093734 0.505083
C  3.524889 -0.924326 -0.706182
C  4.731067 -1.399359 -0.22248
C  5.042076 0.621575 0.988901
C  5.497903 -0.629466 0.627494
H  -1.187383 -0.227664 1.250742
H  -3.116817 0.900275 -0.887276
H  -2.337135 3.106166 -0.353179
H  -3.498634 3.412089 0.931796
H  -1.773134 3.527218 1.262692
H  -2.243698 1.903951 3.216219
H  -3.926625 1.656293 2.753625
H  -2.836638 0.282316 2.897927
H  -3.520557 -1.245355 1.325485
H  1.856834 1.966587 -1.054161
H  1.607837 0.469043 -1.931445
H  6.441625 -1.000825 1.003287
totalener: -2049.15344685 hartree
nucrepener: 2155.86990762 hartree
electener: -4205.02335447 hartree
oneelecener: -7107.80318859 hartree
twoeener: 2902.77983413 hartree
kineticenergy: 2043.57890360 hartree
xcener: -143.166650440506 hartree
chargesum: 0.0000000
charge: -0.039688 -0.046286 -0.184520 -0.183128 -0.180643 -0.181116 -0.258507 -0.380180 0.066649 -0.088498 0.044931 -0.250342 -0.238964 -0.203203 0.339357 0.051077 0.063922 -0.215339 0.270492 0.274918 0.160506 0.162187 -0.150063 0.076875 0.088852 0.103088 0.089343 0.087871 0.094050 0.098806 0.071373 0.097302 0.112483 0.113542 0.132851
qa: -0.0397 -0.0463 -0.1845 -0.1831 -0.1806 -0.1811 -0.2585 -0.3802 0.0666 -0.0885 0.0449 -0.2503 -0.2390 -0.2032 0.3394 0.0511 0.0639 -0.2153 0.2705 0.2749 0.1605 0.1622 -0.1501 0.0769 0.0889 0.1031 0.0893 0.0879 0.0941 0.0988 0.0714 0.0973 0.1125 0.1135 0.1329
va: 1.2874 1.2590 1.1224 1.1246 1.1143 1.1138 2.1361 2.1199 3.7621 3.9048 3.8105 3.9135 3.9093 3.9195 4.2338 4.2461 3.8366 3.7180 3.8746 3.8733 4.0036 4.0029 3.8471 1.0354 1.0503 1.0211 1.0016 1.0016 1.0044 1.0033 1.0098 1.0290 1.0066 1.0061 1.0071
dispcorr: -0.015759267 hartree
energy: -2049.169206112470
dipole: -14.29889 14.95319 0.65430 17.95469 -17.80521 0.14948 11.01523 -10.15433 0.86090
magnitude: 1.09160 au
magnitude: 2.77463 debye
