program: Orca
programVersion: 5.0.2
elementType: Cl Cl F F F F O O C C C C C C C C C C C C C C C H H H H H H H H H H H H
charge: 0
multiplicity: 1
keywords: wb97x-d3
keywords: def2-TZVPP
keywords: def2/J RIJCOSX
keywords: DEFGRID2
keywords: scfconv7
keywords: smallprint printgap noloewdin
keywords: NOSOSCF
formula: C15H12Cl2F4O2
InChI: InChI=1/C15H12Cl2F4O2/c1-15(2)7(3-10(16)17)11(15)14(22)23-5-6-12(20)8(18)4-9(19)13(6)21/h3-4,7,11H,5H2,1-2H3
35 atoms
Cl -4.354724 -0.721464 1.864775
Cl -5.062843 2.072935 1.72099
F  2.936562 2.205625 -1.355648
F  2.956127 -2.353102 -0.200851
F  4.1501 -1.757636 2.111673
F  4.174188 2.788125 0.956215
O  0.85694 0.190099 -2.133198
O  0.153165 -1.419348 -0.75175
C  -2.617151 -0.518377 -1.979867
C  -1.38464 0.241236 -1.52461
C  -2.473283 -0.111038 -0.541295
C  -2.539734 -1.988245 -2.311076
C  -3.575741 0.239799 -2.866471
C  -3.298815 0.954133 0.049258
C  -0.072737 -0.434459 -1.400053
C  -4.124352 0.786192 1.074959
C  2.166849 -0.368998 -2.120961
C  2.884212 -0.083507 -0.831573
C  3.220228 1.223066 -0.503805
C  3.218143 -1.082085 0.071457
C  3.852607 -0.777451 1.264249
C  3.860271 1.525138 0.682702
C  4.177032 0.524766 1.579372
H  -1.330039 1.270992 -1.861641
H  -2.219067 -0.923308 0.130663
H  -3.536178 -2.428539 -2.249132
H  -2.177071 -2.13761 -3.330142
H  -1.891603 -2.542973 -1.637112
H  -3.583131 1.311631 -2.670621
H  -3.313512 0.101338 -3.916407
H  -4.594015 -0.126295 -2.725733
H  -3.241993 1.950445 -0.372385
H  2.680967 0.107854 -2.954014
H  2.133708 -1.440535 -2.314428
H  4.675114 0.757495 2.510722
totalener: -2049.15155405 hartree
nucrepener: 2225.50647330 hartree
electener: -4274.65802735 hartree
oneelecener: -7247.50937173 hartree
twoeener: 2972.85134437 hartree
kineticenergy: 2043.58300659 hartree
xcener: -143.168005809242 hartree
chargesum: 0.0000000
charge: -0.039461 -0.044673 -0.183426 -0.177325 -0.182179 -0.183906 -0.260686 -0.379929 0.079143 -0.114654 0.030922 -0.254412 -0.231405 -0.199038 0.356992 0.044198 0.057980 -0.206893 0.205226 0.303539 0.175480 0.180471 -0.172311 0.080921 0.093364 0.090148 0.087282 0.102698 0.071433 0.093536 0.098791 0.103962 0.124240 0.117492 0.132481
qa: -0.0395 -0.0447 -0.1834 -0.1773 -0.1822 -0.1839 -0.2607 -0.3799 0.0791 -0.1147 0.0309 -0.2544 -0.2314 -0.1990 0.3570 0.0442 0.0580 -0.2069 0.2052 0.3035 0.1755 0.1805 -0.1723 0.0809 0.0934 0.0901 0.0873 0.1027 0.0714 0.0935 0.0988 0.1040 0.1242 0.1175 0.1325
va: 1.2879 1.2617 1.1217 1.1305 1.1137 1.1106 2.1369 2.1251 3.7638 3.8766 3.8043 3.9133 3.9038 3.8935 4.2346 4.2397 3.8704 3.6160 3.9391 3.8369 4.0017 3.9799 3.8691 1.0356 1.0462 1.0027 1.0014 1.0206 1.0090 1.0048 1.0039 1.0237 0.9924 1.0183 1.0076
dispcorr: -0.016870040 hartree
energy: -2049.168424094582
dipole: -15.57573 15.75105 0.17532 -7.05648 7.32251 0.26603 -26.00340 24.95233 -1.05107
magnitude: 1.09829 au
magnitude: 2.79164 debye
