program: Orca
programVersion: 5.0.2
elementType: Cl Cl F F F F O O C C C C C C C C C C C C C C C H H H H H H H H H H H H
charge: 0
multiplicity: 1
keywords: wb97x-d3
keywords: def2-TZVPP
keywords: def2/J RIJCOSX
keywords: DEFGRID2
keywords: scfconv7
keywords: smallprint printgap noloewdin
keywords: NOSOSCF
formula: C15H12Cl2F4O2
InChI: InChI=1/C15H12Cl2F4O2/c1-15(2)7(3-10(16)17)11(15)14(22)23-5-6-12(20)8(18)4-9(19)13(6)21/h3-4,7,11H,5H2,1-2H3
35 atoms
Cl -2.73656 2.214676 0.8278
Cl -5.342593 1.925217 -0.374509
F  2.877489 -2.090205 1.054642
F  2.254255 1.31211 -2.127275
F  3.635863 3.010632 -0.577338
F  4.268995 -0.388259 2.594859
O  0.388324 -1.261475 -0.966909
O  -0.237786 -2.859173 -2.395104
C  -2.230553 -2.137528 0.484914
C  -1.876482 -1.914553 -0.9704
C  -2.281832 -0.750201 -0.094093
C  -1.160967 -2.434124 1.508409
C  -3.515733 -2.8853 0.749854
C  -3.550473 -0.059356 -0.360619
C  -0.511626 -2.077438 -1.527096
C  -3.830963 1.190739 -0.013302
C  1.734477 -1.381793 -1.420343
C  2.543836 -0.438328 -0.584186
C  3.0648 -0.839844 0.636911
C  2.74599 0.878406 -0.970708
C  3.460289 1.756185 -0.17434
C  3.78062 0.034914 1.433487
C  3.981996 1.340341 1.033203
H  -2.622136 -2.276716 -1.66975
H  -1.471007 -0.104133 0.218967
H  -0.257226 -1.84686 1.368573
H  -1.540578 -2.216542 2.50785
H  -0.884152 -3.489678 1.484148
H  -3.951573 -2.572271 1.699746
H  -4.267485 -2.733885 -0.023705
H  -3.323606 -3.957562 0.807494
H  -4.32849 -0.599152 -0.886515
H  1.803575 -1.130185 -2.479017
H  2.088118 -2.407427 -1.308058
H  4.539136 2.027028 1.655851
totalener: -2049.15037948 hartree
nucrepener: 2249.08886257 hartree
electener: -4298.23924206 hartree
oneelecener: -7294.01110562 hartree
twoeener: 2995.77186356 hartree
kineticenergy: 2043.57673911 hartree
xcener: -143.165516780701 hartree
chargesum: 0.0000000
charge: -0.044348 -0.044677 -0.187826 -0.182594 -0.179908 -0.180801 -0.265522 -0.349674 0.065344 -0.092973 0.082204 -0.243078 -0.243067 -0.223610 0.330365 0.054211 0.056070 -0.215822 0.259922 0.265618 0.168193 0.173346 -0.155615 0.081681 0.078390 0.079536 0.090516 0.095719 0.097489 0.071971 0.095944 0.098148 0.115818 0.115484 0.133546
qa: -0.0443 -0.0447 -0.1878 -0.1826 -0.1799 -0.1808 -0.2655 -0.3497 0.0653 -0.0930 0.0822 -0.2431 -0.2431 -0.2236 0.3304 0.0542 0.0561 -0.2158 0.2599 0.2656 0.1682 0.1733 -0.1556 0.0817 0.0784 0.0795 0.0905 0.0957 0.0975 0.0720 0.0959 0.0981 0.1158 0.1155 0.1335
va: 1.2832 1.2615 1.1135 1.1250 1.1158 1.1158 2.1029 2.1550 3.7578 3.8861 3.7612 3.9213 3.9134 3.9284 4.2729 4.2406 3.8411 3.7335 3.8458 3.8851 4.0016 4.0125 3.8559 1.0333 1.0453 1.0177 1.0033 1.0023 1.0026 1.0104 1.0038 1.0287 1.0079 1.0087 1.0069
dispcorr: -0.017187900 hartree
energy: -2049.167567384526
dipole: -14.27355 14.48020 0.20664 -27.02196 26.79757 -0.22439 1.89173 -1.25667 0.63506
magnitude: 0.70452 au
magnitude: 1.79075 debye
