program: Orca
programVersion: 5.0.2
elementType: Cl Cl F F F F O O C C C C C C C C C C C C C C C H H H H H H H H H H H H
charge: 0
multiplicity: 1
keywords: wb97x-d3
keywords: def2-TZVPP
keywords: def2/J RIJCOSX
keywords: DEFGRID2
keywords: scfconv7
keywords: smallprint printgap noloewdin
keywords: NOSOSCF
formula: C15H12Cl2F4O2
InChI: InChI=1/C15H12Cl2F4O2/c1-15(2)7(3-10(16)17)11(15)14(22)23-5-6-12(20)8(18)4-9(19)13(6)21/h3-4,7,11H,5H2,1-2H3
35 atoms
Cl -2.336929 0.994586 2.018653
Cl -4.744388 1.678881 0.583368
F  4.484315 -0.91929 -0.747557
F  0.53367 1.63529 -1.010004
F  1.248405 2.951416 1.188603
F  5.209639 0.442215 1.425784
O  0.696299 -0.803277 -2.201478
O  0.869846 -1.967663 -0.305754
C  -2.134008 -2.694097 -0.738894
C  -1.278987 -1.591743 -1.313767
C  -2.108396 -1.364335 -0.049316
C  -1.523603 -3.869014 -0.014689
C  -3.326508 -3.084393 -1.580334
C  -3.221452 -0.411153 -0.107442
C  0.188001 -1.513089 -1.190804
C  -3.401939 0.608206 0.723512
C  2.081954 -0.48892 -2.162271
C  2.47719 0.297396 -0.93972
C  3.669787 0.03198 -0.28588
C  1.68638 1.312529 -0.421371
C  2.057154 2.002549 0.717289
C  4.049323 0.737344 0.840033
C  3.244371 1.727092 1.360796
H  -1.671227 -1.127481 -2.211166
H  -1.521213 -1.342002 0.862108
H  -1.098642 -4.584438 -0.721096
H  -0.745097 -3.585609 0.688386
H  -2.301828 -4.386823 0.548893
H  -4.143421 -3.444583 -0.952398
H  -3.707661 -2.267688 -2.192685
H  -3.050824 -3.89156 -2.261168
H  -3.955321 -0.528818 -0.895841
H  2.260104 0.100776 -3.061205
H  2.677682 -1.398091 -2.243953
H  3.536656 2.274209 2.24795
elementType: Cl F O C H
totalener: -2049.16518049 hartree
nucrepener: 2316.36043530 hartree
electener: -4365.52561579 hartree
oneelecener: -7429.78152436 hartree
twoeener: 3064.25590858 hartree
cpcmener: -0.02082239 hartree
kineticenergy: 2043.55088380 hartree
xcener: -143.167571958645 hartree
chargesum: -0.0000000
charge: -0.055892 -0.059124 -0.203693 -0.201394 -0.203156 -0.202685 -0.282647 -0.451355 0.113743 -0.051609 -0.016417 -0.268985 -0.282157 -0.173947 0.375500 0.034505 0.072455 -0.095011 0.226790 0.198308 0.196356 0.196909 -0.174394 0.096826 0.088767 0.098838 0.094265 0.095349 0.104062 0.092562 0.098742 0.126520 0.134036 0.125078 0.152856
qa: -0.0559 -0.0591 -0.2037 -0.2014 -0.2032 -0.2027 -0.2826 -0.4514 0.1137 -0.0516 -0.0164 -0.2690 -0.2822 -0.1739 0.3755 0.0345 0.0725 -0.0950 0.2268 0.1983 0.1964 0.1969 -0.1744 0.0968 0.0888 0.0988 0.0943 0.0953 0.1041 0.0926 0.0987 0.1265 0.1340 0.1251 0.1529
va: 1.2709 1.2463 1.0953 1.0951 1.0856 1.0859 2.1211 2.0529 3.7642 3.8046 3.9074 3.8901 3.9132 3.8838 4.1710 4.2190 3.8422 3.5527 3.9241 3.9350 3.9635 3.9602 3.8719 1.0332 1.0422 1.0000 1.0217 1.0000 0.9997 1.0040 1.0013 1.0208 0.9923 1.0143 0.9990
dispcorr: -0.017927359 hartree
energy: -2049.183107850199
dipole: -14.07971 13.72674 -0.35297 -30.18300 29.63690 -0.54610 -13.83440 12.51134 -1.32306
magnitude: 1.47421 au
magnitude: 3.74715 debye
