program: Orca
programVersion: 5.0.2
elementType: Cl Cl F F F F O O C C C C C C C C C C C C C C C H H H H H H H H H H H H
charge: 0
multiplicity: 1
keywords: wb97x-d3
keywords: def2-TZVPP
keywords: def2/J RIJCOSX
keywords: DEFGRID2
keywords: scfconv7
keywords: smallprint printgap noloewdin
keywords: NOSOSCF
formula: C15H12Cl2F4O2
InChI: InChI=1/C15H12Cl2F4O2/c1-15(2)7(3-10(16)17)11(15)14(22)23-5-6-12(20)8(18)4-9(19)13(6)21/h3-4,7,11H,5H2,1-2H3
35 atoms
Cl -2.039827 1.352473 2.130797
Cl -4.190372 2.703214 0.761915
F  0.950832 1.557982 -1.007917
F  4.101292 -1.933962 -0.787699
F  5.048341 -0.93051 1.497107
F  1.861661 2.511293 1.311288
O  0.511901 -0.812875 -2.273562
O  0.397485 -2.107569 -0.459366
C  -2.692765 -2.062374 -0.887308
C  -1.597528 -1.16648 -1.411341
C  -2.344909 -0.822191 -0.121977
C  -2.388951 -3.391683 -0.240053
C  -3.947673 -2.096887 -1.728003
C  -3.197188 0.371472 -0.101366
C  -0.153633 -1.448673 -1.305958
C  -3.142651 1.336103 0.809168
C  1.933795 -0.829322 -2.227069
C  2.482286 -0.234463 -0.957461
C  1.951532 0.918707 -0.399412
C  3.5383 -0.832483 -0.28906
C  4.033018 -0.313192 0.892175
C  2.429913 1.422133 0.795432
C  3.479502 0.816842 1.453047
H  -1.868427 -0.569341 -2.274373
H  -1.767614 -0.999357 0.778533
H  -2.144196 -4.145281 -0.990726
H  -1.570688 -3.348185 0.474112
H  -3.273949 -3.738617 0.296845
H  -4.123087 -1.17211 -2.277143
H  -3.880364 -2.898899 -2.465107
H  -4.823741 -2.290492 -1.106439
H  -3.92704 0.4924 -0.892833
H  2.248386 -0.240362 -3.088501
H  2.305054 -1.844096 -2.370764
H  3.859789 1.220257 2.382607
elementType: Cl F O C H
totalener: -2049.16544309 hartree
nucrepener: 2318.67918091 hartree
electener: -4367.84462400 hartree
oneelecener: -7434.40411883 hartree
twoeener: 3066.55949483 hartree
cpcmener: -0.02093443 hartree
kineticenergy: 2043.54658721 hartree
xcener: -143.166778883605 hartree
chargesum: -0.0000000
charge: -0.056586 -0.059309 -0.201124 -0.203629 -0.202837 -0.203167 -0.282053 -0.451560 0.110928 -0.051061 -0.013860 -0.270166 -0.281232 -0.176287 0.375511 0.036459 0.071747 -0.098649 0.199494 0.229108 0.198790 0.196652 -0.176093 0.096540 0.088227 0.099046 0.095298 0.095247 0.091708 0.099300 0.104017 0.127089 0.134218 0.124657 0.153577
qa: -0.0566 -0.0593 -0.2011 -0.2036 -0.2028 -0.2032 -0.2821 -0.4516 0.1109 -0.0511 -0.0139 -0.2702 -0.2812 -0.1763 0.3755 0.0365 0.0717 -0.0986 0.1995 0.2291 0.1988 0.1967 -0.1761 0.0965 0.0882 0.0990 0.0953 0.0952 0.0917 0.0993 0.1040 0.1271 0.1342 0.1247 0.1536
va: 1.2698 1.2458 1.0953 1.0955 1.0855 1.0851 2.1208 2.0539 3.7622 3.8048 3.9082 3.8898 3.9130 3.8869 4.1741 4.2165 3.8433 3.5566 3.9365 3.9182 3.9573 3.9603 3.8702 1.0329 1.0431 0.9998 1.0209 1.0001 1.0044 1.0013 0.9999 1.0207 0.9920 1.0144 0.9986
dispcorr: -0.017959585 hartree
energy: -2049.183402672624
dipole: -20.58556 20.12404 -0.46151 -24.93183 24.58584 -0.34599 -15.65249 14.30903 -1.34346
magnitude: 1.46205 au
magnitude: 3.71624 debye
