program: Orca
programVersion: 5.0.2
elementType: Cl Cl F F F F O O C C C C C C C C C C C C C C C H H H H H H H H H H H H
charge: 0
multiplicity: 1
keywords: wb97x-d3
keywords: def2-TZVPP
keywords: def2/J RIJCOSX
keywords: DEFGRID2
keywords: scfconv7
keywords: smallprint printgap noloewdin
keywords: NOSOSCF
formula: C15H12Cl2F4O2
InChI: InChI=1/C15H12Cl2F4O2/c1-15(2)7(3-10(16)17)11(15)14(22)23-5-6-12(20)8(18)4-9(19)13(6)21/h3-4,7,11H,5H2,1-2H3
35 atoms
Cl -3.332637 -2.536496 1.181343
Cl -5.076431 -0.515059 2.277546
F  3.741462 1.260902 -2.018205
F  1.508165 -1.339717 1.201578
F  2.957299 -0.179482 3.137966
F  5.196493 2.39414 -0.086557
O  0.352678 -0.509142 -1.313429
O  0.60175 1.658069 -1.781558
C  -2.582084 0.293171 -2.228768
C  -1.563618 0.864189 -1.267009
C  -2.457873 -0.278866 -0.840357
C  -2.129414 -0.57513 -3.377496
C  -3.745892 1.184996 -2.58351
C  -3.466649 -0.027571 0.195716
C  -0.10631 0.727468 -1.483554
C  -3.890617 -0.910125 1.091051
C  1.746725 -0.732237 -1.522753
C  2.582626 -0.075581 -0.461228
C  3.533404 0.887801 -0.756436
C  2.411272 -0.416273 0.872043
C  3.158517 0.178806 1.869923
C  4.288193 1.475727 0.242603
C  4.106937 1.132275 1.564786
H  -1.817788 1.845198 -0.879315
H  -1.98585 -1.252803 -0.799371
H  -2.974852 -1.147359 -3.764111
H  -1.743435 0.035484 -4.196452
H  -1.35709 -1.2903 -3.09831
H  -4.627166 0.588832 -2.828216
H  -4.01857 1.872836 -1.784041
H  -3.50124 1.788895 -3.459326
H  -3.899218 0.964101 0.253119
H  2.042029 -0.40755 -2.519608
H  1.866279 -1.813844 -1.484337
H  4.695886 1.59805 2.344626
elementType: Cl F O C H
totalener: -2049.16673821 hartree
nucrepener: 2254.74116072 hartree
electener: -4303.90789893 hartree
oneelecener: -7306.05050960 hartree
twoeener: 3002.14261068 hartree
cpcmener: -0.02273754 hartree
kineticenergy: 2043.54398999 hartree
xcener: -143.165518327317 hartree
chargesum: 0.0000000
charge: -0.056940 -0.061669 -0.202477 -0.201297 -0.202482 -0.202719 -0.274565 -0.450504 0.069526 -0.110652 0.068329 -0.261538 -0.268796 -0.220190 0.428669 0.042727 0.049455 -0.149028 0.267218 0.220119 0.188013 0.196044 -0.170581 0.099986 0.078801 0.098388 0.101864 0.091617 0.099749 0.090545 0.098266 0.129494 0.124281 0.136370 0.153980
qa: -0.0569 -0.0617 -0.2025 -0.2013 -0.2025 -0.2027 -0.2746 -0.4505 0.0695 -0.1107 0.0683 -0.2615 -0.2688 -0.2202 0.4287 0.0427 0.0495 -0.1490 0.2672 0.2201 0.1880 0.1960 -0.1706 0.1000 0.0788 0.0984 0.1019 0.0916 0.0997 0.0905 0.0983 0.1295 0.1243 0.1364 0.1540
va: 1.2690 1.2433 1.0959 1.0979 1.0867 1.0862 2.1222 2.0670 3.7780 3.8409 3.8014 3.9050 3.9053 3.8913 4.1707 4.2103 3.8501 3.5984 3.8690 3.9235 3.9625 3.9619 3.8645 1.0289 1.0466 1.0005 1.0005 1.0142 1.0012 1.0059 1.0012 1.0190 1.0154 0.9941 0.9987
dispcorr: -0.017340204 hartree
energy: -2049.184078410149
dipole: -17.06413 16.88232 -0.18181 4.76509 -5.14388 -0.37879 -27.45384 26.64140 -0.81244
magnitude: 0.91465 au
magnitude: 2.32486 debye
