program: Orca
programVersion: 5.0.2
elementType: Cl Cl F F F F O O C C C C C C C C C C C C C C C H H H H H H H H H H H H
charge: 0
multiplicity: 1
keywords: wb97x-d3
keywords: def2-TZVPP
keywords: def2/J RIJCOSX
keywords: DEFGRID2
keywords: scfconv7
keywords: smallprint printgap noloewdin
keywords: NOSOSCF
formula: C15H12Cl2F4O2
InChI: InChI=1/C15H12Cl2F4O2/c1-15(2)7(3-10(16)17)11(15)14(22)23-5-6-12(20)8(18)4-9(19)13(6)21/h3-4,7,11H,5H2,1-2H3
35 atoms
Cl -3.191011 -2.485431 1.334717
Cl -5.056212 -0.491828 2.268039
F  3.726924 1.109525 -2.064592
F  1.490017 -1.267006 1.325591
F  2.905829 0.054044 3.175851
F  5.145118 2.407503 -0.217611
O  0.347155 -0.608413 -1.269806
O  0.613455 1.523989 -1.870805
C  -2.571794 0.168092 -2.282209
C  -1.562451 0.772385 -1.33116
C  -2.460806 -0.356405 -0.873738
C  -2.106449 -0.736836 -3.396628
C  -3.733143 1.046134 -2.677769
C  -3.479722 -0.078218 0.145185
C  -0.102862 0.618106 -1.522129
C  -3.851294 -0.910684 1.109925
C  1.742581 -0.851241 -1.443423
C  2.565602 -0.117738 -0.422514
C  3.509371 0.83127 -0.780048
C  2.385221 -0.360495 0.931025
C  3.116449 0.318714 1.886167
C  4.246509 1.504546 0.176698
C  4.055884 1.259477 1.51967
H  -1.816596 1.767933 -0.982287
H  -1.985029 -1.326081 -0.795977
H  -2.942503 -1.33603 -3.762034
H  -1.729034 -0.151405 -4.237582
H  -1.323237 -1.428743 -3.090469
H  -4.009049 1.764092 -1.906548
H  -3.484186 1.61629 -3.574717
H  -4.613389 0.44109 -2.903929
H  -3.969741 0.888058 0.124916
H  2.052497 -0.601254 -2.457377
H  1.856996 -1.927492 -1.324003
H  4.628857 1.790727 2.2690
elementType: Cl F O C H
totalener: -2049.16669411 hartree
nucrepener: 2258.81767859 hartree
electener: -4307.98437270 hartree
oneelecener: -7314.24293673 hartree
twoeener: 3006.25856403 hartree
cpcmener: -0.02272415 hartree
kineticenergy: 2043.53680138 hartree
xcener: -143.164309395574 hartree
chargesum: 0.0000000
charge: -0.057222 -0.061758 -0.202761 -0.201345 -0.202762 -0.202791 -0.274336 -0.449526 0.068685 -0.106205 0.063494 -0.260335 -0.273241 -0.217145 0.428772 0.044021 0.047975 -0.148847 0.268288 0.218599 0.189678 0.196072 -0.170421 0.101200 0.077543 0.098669 0.101324 0.091471 0.091516 0.098208 0.100508 0.128511 0.124640 0.135997 0.153529
qa: -0.0572 -0.0618 -0.2028 -0.2013 -0.2028 -0.2028 -0.2743 -0.4495 0.0687 -0.1062 0.0635 -0.2603 -0.2732 -0.2171 0.4288 0.0440 0.0480 -0.1488 0.2683 0.2186 0.1897 0.1961 -0.1704 0.1012 0.0775 0.0987 0.1013 0.0915 0.0915 0.0982 0.1005 0.1285 0.1246 0.1360 0.1535
va: 1.2685 1.2433 1.0955 1.0984 1.0862 1.0864 2.1224 2.0681 3.7865 3.8307 3.8036 3.9039 3.9053 3.8945 4.1748 4.2100 3.8508 3.5996 3.8652 3.9275 3.9583 3.9646 3.8668 1.0278 1.0476 1.0004 1.0008 1.0144 1.0060 1.0013 1.0007 1.0200 1.0151 0.9941 0.9989
dispcorr: -0.017376181 hartree
energy: -2049.184070291921
dipole: -17.19019 16.97385 -0.21634 3.38902 -3.78746 -0.39844 -28.03693 27.22982 -0.80711
magnitude: 0.92573 au
magnitude: 2.35303 debye
