program: Orca
programVersion: 5.0.2
elementType: Cl Cl F F F F O O C C C C C C C C C C C C C C C H H H H H H H H H H H H
charge: 0
multiplicity: 1
keywords: wb97x-d3
keywords: def2-TZVPP
keywords: def2/J RIJCOSX
keywords: DEFGRID2
keywords: scfconv7
keywords: smallprint printgap noloewdin
keywords: NOSOSCF
formula: C15H12Cl2F4O2
InChI: InChI=1/C15H12Cl2F4O2/c1-15(2)7(3-10(16)17)11(15)14(22)23-5-6-12(20)8(18)4-9(19)13(6)21/h3-4,7,11H,5H2,1-2H3
35 atoms
Cl -2.790446 0.899144 2.513611
Cl -4.560018 2.514182 0.906891
F  1.826934 1.890126 -1.495434
F  3.590106 -2.276412 -0.214129
F  4.737788 -1.141853 1.902636
F  2.952116 3.016326 0.654341
O  0.620321 -0.673405 -2.152074
O  0.407615 -1.969614 -0.347403
C  -2.635365 -1.957497 -1.011137
C  -1.529231 -0.99316 -1.374389
C  -2.379176 -0.771686 -0.129398
C  -2.336725 -3.324533 -0.445359
C  -3.825232 -1.961952 -1.941501
C  -3.269715 0.393029 -0.09444
C  -0.093266 -1.288248 -1.207486
C  -3.506465 1.151869 0.968396
C  2.036025 -0.845573 -2.131701
C  2.673637 -0.226166 -0.920555
C  2.533966 1.127783 -0.661068
C  3.42196 -0.969815 -0.023519
C  4.016819 -0.382926 1.077169
C  3.117398 1.711083 0.446414
C  3.867458 0.962631 1.328316
H  -1.753346 -0.340603 -2.210327
H  -1.876434 -1.007784 0.80142
H  -3.250246 -3.740209 -0.016462
H  -2.00202 -4.007613 -1.227901
H  -1.584023 -3.314143 0.338288
H  -4.739519 -2.20441 -1.396999
H  -3.980421 -1.010972 -2.449923
H  -3.6896 -2.721026 -2.713914
H  -3.773566 0.673255 -1.011739
H  2.389486 -0.353867 -3.036411
H  2.292488 -1.900602 -2.215002
H  4.326133 1.42134 2.194424
elementType: Cl F O C H
totalener: -2049.16796281 hartree
nucrepener: 2262.92246261 hartree
electener: -4312.09042543 hartree
oneelecener: -7322.70089703 hartree
twoeener: 3010.61047160 hartree
cpcmener: -0.02111610 hartree
kineticenergy: 2043.57006184 hartree
xcener: -143.170603079063 hartree
chargesum: 0.0000000
charge: -0.055608 -0.060363 -0.201210 -0.203510 -0.202881 -0.202501 -0.281529 -0.460177 0.099254 -0.080570 0.017566 -0.269732 -0.272186 -0.196053 0.410041 0.041226 0.072365 -0.150044 0.204636 0.275219 0.194694 0.192521 -0.171275 0.093221 0.084608 0.095490 0.099087 0.094698 0.101435 0.091904 0.098295 0.126826 0.139597 0.121684 0.153271
qa: -0.0556 -0.0604 -0.2012 -0.2035 -0.2029 -0.2025 -0.2815 -0.4602 0.0993 -0.0806 0.0176 -0.2697 -0.2722 -0.1961 0.4100 0.0412 0.0724 -0.1500 0.2046 0.2752 0.1947 0.1925 -0.1713 0.0932 0.0846 0.0955 0.0991 0.0947 0.1014 0.0919 0.0983 0.1268 0.1396 0.1217 0.1533
va: 1.2701 1.2442 1.0981 1.0950 1.0860 1.0863 2.1280 2.0558 3.7212 3.8334 3.8852 3.8986 3.9134 3.9013 4.1605 4.2123 3.8333 3.5869 3.9500 3.8487 3.9648 3.9548 3.8654 1.0348 1.0441 0.9997 0.9998 1.0214 1.0007 1.0054 1.0010 1.0202 0.9900 1.0184 0.9989
dispcorr: -0.016896949 hartree
energy: -2049.184859760680
dipole: -18.97440 18.77887 -0.19553 -23.35868 23.06556 -0.29313 -17.70016 16.18308 -1.51708
magnitude: 1.55746 au
magnitude: 3.95874 debye
