program: Gaussian 09
title: 000071200
version: EM64L-G09RevD.01
frameworkgroup: C1[X(C17H28N2O2)]
method: RPBEPBE
basis: SDD
operation: Freq
keyword: #p
keyword: freq=noraman
keyword: PBEPBE/SDD
title: #p freq=noraman PBEPBE/SDD
converged: YES YES NO NO
title: Mulliken charges:
elementType: O O N N C C C C C C C C C C C C C C C C C H H H H H H H H H H H H H H H H H H H H H H H H H H H H
charge: -0.307039 -0.299927 -0.134116 -0.124985 -0.219395 -0.273676 -0.286576 -0.262428 -0.540319 -0.218753 -0.205192 0.228439 0.179238 -0.382705 -0.345954 -0.351203 -0.407329 -0.651897 -0.664354 -0.667818 -0.651279 0.226247 0.259229 0.277627 0.295161 0.248591 0.269839 0.233576 0.236956 0.221121 0.239571 0.256918 0.201326 0.256492 0.202982 0.283384 0.212433 0.219877 0.231195 0.216616 0.204430 0.250759 0.215540 0.214435 0.205327 0.248191 0.219820 0.211477 0.228147
chargesum: 0.00000
title: Mulliken charges with hydrogens summed into heavy atoms:
elementType: O O N N C C C C C C C C C C C C C C C C C
charge: -0.307039 -0.299927 -0.134116 -0.124985 0.006852 -0.014447 -0.008948 0.032733 -0.021889 0.014824 0.031763 0.228439 0.179238 0.077988 0.112290 0.108271 0.088488 0.015792 0.006375 0.000135 0.008165
polarizability: 2.14353329e+02 1.16395568e+00 1.93064720e+02 -5.13809102e+00 2.83862686e+00 1.85973960e+02
1716.lowfreq: -12.7874 -7.1587 -2.7302 -0.0008 -0.0006 -0.0005 4.5018 28.8427 38.6883
frequency: -3.7454 28.7807 38.6582 51.9741 60.0734 62.1871 76.0204 87.4870 97.8230 120.9536 125.5276 136.5209 152.3928 177.3105 192.3509 214.5429 221.2621 230.3056 253.3299 281.1816 292.4872 320.1225 325.4421 351.0819 372.5034 383.8572 425.6306 433.3619 469.8854 484.9299 517.0587 530.6622 586.7309 605.6017 643.1694 684.4861 697.6422 719.5529 757.0899 768.2374 773.9920 780.6504 783.7606 794.9403 805.1086 830.4242 857.0322 899.8516 905.7463 920.7785 924.4225 927.5553 940.8697 949.8577 957.5440 971.9044 995.3719 998.1527 1025.8567 1029.5110 1052.0193 1069.2448 1073.3282 1079.1141 1080.4836 1091.2012 1096.6818 1097.2897 1107.5817 1140.7421 1143.2240 1151.3332 1181.1236 1203.0541 1207.4999 1211.1938 1226.4125 1236.9471 1252.9947 1259.5872 1264.2790 1282.1744 1299.3232 1300.6877 1318.4342 1325.9651 1339.9785 1347.0406 1351.6803 1357.9849 1363.0928 1381.0671 1384.4795 1386.7314 1389.4793 1414.3124 1421.8693 1452.0451 1452.2743 1465.2544 1466.4351 1468.4402 1469.8731 1470.9393 1476.8543 1478.7753 1482.6502 1483.9945 1495.4404 1510.4418 1560.5676 1566.2542 1580.0821 2981.3901 2981.7178 2982.9267 2983.7151 2995.1476 3000.4223 3003.6995 3005.7516 3019.2921 3024.8070 3055.3457 3066.0663 3066.3816 3070.6375 3072.1640 3081.2962 3082.4515 3082.8840 3083.1381 3084.1212 3087.1603 3095.0718 3096.2052 3099.7084 3100.5977 3104.5886 3156.2361 3189.2439
redmass: 3.9861 3.4996 3.2505 3.0040 2.9905 3.6913 2.8307 3.6396 3.4614 4.0046 3.6342 2.7258 4.5409 2.2344 1.1812 1.0727 1.4478 1.1728 2.4882 3.0178 3.3011 2.8209 2.7897 2.9529 3.4395 3.5280 2.6485 2.8406 2.0746 3.4396 2.9922 3.1566 3.6050 3.4878 4.9198 3.5169 5.3945 2.1579 2.2051 1.6159 2.6024 1.2865 1.3667 1.3769 2.7653 2.3920 2.8970 2.3575 2.5642 1.5850 2.2739 2.6127 2.1796 2.4297 2.5577 2.4958 1.8968 1.9335 2.2052 2.5764 2.5359 2.0813 2.1037 1.8310 1.8287 1.2679 1.7465 1.7652 1.1471 1.7396 1.9160 1.8240 1.2549 1.6157 2.6116 2.6531 1.4263 1.4959 1.4773 1.4905 1.4283 1.3919 1.2853 1.3294 1.3896 1.7166 1.2642 1.3028 1.3115 1.2896 1.2919 1.2189 1.2202 1.2124 1.2090 2.5291 2.5705 1.1424 1.1540 1.0468 1.0449 1.0430 1.0442 1.1091 1.0494 1.0589 1.0548 1.0558 1.1161 1.0904 5.5855 5.1104 5.6193 1.0353 1.0356 1.0358 1.0354 1.0642 1.0658 1.0632 1.0647 1.0830 1.0601 1.0997 1.0994 1.0995 1.0917 1.0935 1.0967 1.0981 1.0939 1.0956 1.0985 1.0981 1.0912 1.0999 1.1022 1.1020 1.1075 1.0874 1.1094
irintensity: 2.9269 0.3479 0.9495 0.1598 0.5555 2.4586 0.7179 3.1422 2.6523 0.1516 0.2764 5.0998 2.5562 0.6906 0.0130 0.0414 0.5482 2.7765 0.4281 2.4312 2.5768 3.4090 4.0710 5.3521 7.3356 10.1814 6.8701 7.5505 2.9819 7.3381 4.3765 5.8914 9.0255 2.1671 5.9565 13.7374 12.8444 38.9721 7.7564 4.0264 2.1492 10.1811 7.2938 21.3354 5.8276 1.1936 8.1453 7.5563 11.2177 1.1980 5.7738 7.1535 8.0254 7.4934 3.1830 3.8666 1.6655 2.8237 4.0229 4.9340 17.1515 13.6930 11.6687 7.8135 8.7144 9.2434 12.6253 16.3077 25.1161 22.4326 51.3170 26.9862 4.6448 10.1159 28.7569 19.7186 7.7917 20.7604 61.0817 77.8397 40.8896 1.7205 14.4220 14.8264 17.1433 14.0458 4.3605 7.6307 2.2566 8.2520 10.9588 13.7067 16.0670 25.5740 29.6984 136.4917 100.4058 41.1675 21.8868 2.9603 3.0472 14.0646 12.3851 22.7935 7.3239 3.6834 14.9263 10.1968 5.4254 8.5686 271.7246 142.3754 9.6306 24.8400 27.0526 28.2757 20.8053 23.4146 32.7602 56.4094 38.5239 14.2478 31.9583 3.5919 11.4712 7.7235 34.7043 23.6260 25.2161 47.9555 1.5135 59.0178 50.3462 20.8241 18.9964 38.0577 32.0132 37.1395 17.5172 7.1046 18.0591
temp: 298.150 k
press: 1.00000 atm
elementType: 8 8 7 7 6 6 6 6 6 6 6 6 6 6 6 6 6 6 6 6 6 1 1 1 1 1 1 1 1 1 1 1 1 1 1 1 1 1 1 1 1 1 1 1 1 1 1 1 1
symmnumber: 1
zpe: 1115360.2 jmol-1
zpe.correction: 0.424818 hartree
zpe.thermalcorrener: 0.446948 hartree
zpe.thermalcorrenthalpy: 0.447892 hartree
zpe.thermalcorrgfe: 0.373172 hartree
zpe.sumelectzpe: -922.898124 hartree
zpe.sumelectthermal: -922.875994 hartree
zpe.sumelectthermalent: -922.875050 hartree
zpe.sumelectthermalfe: -922.949770 hartree
dipole: 1.9673 -2.5812 0.3461
dipole: 3.2638
quadrupole: -114.7446 -124.4123 -133.9960
quadrupole: -0.5790 -12.9651 2.4475
quadrupole: 9.6397 -0.0280 -9.6117 -0.5790 -12.9651 2.4475
hfenergy: -923.3229418 hartree
pointgroup: C01 [X(C17H28N2O2)]
dipole: -0.7548953 -1.0380062 0.039719 debye
polarizability: 212.8634207|-1.5819905|192.4793834|-8.0755903|-3.3306643|188.0492049 unknown
InChI: InChI=1S/C17H28N2O2/c1-5-18(6-2)16(20)14-12-9-10-13(11-12)15(14)17(21)19(7-3)8-4/h9-10,12-15H,5-8,11H2,1-4H3
charge 0 multiplicity 1
49 atoms
O  -1.334407 -0.538785 -1.558702
O  2.445444 0.425068 1.501321
N  -2.439989 -1.194758 0.36926
N  2.634817 -0.767951 -0.482624
C  -1.182422 1.843982 0.979184
C  0.790416 2.447494 0.026224
C  -0.544524 0.437034 0.557149
C  0.754087 0.871298 -0.212378
C  0.12399 2.568497 1.429196
C  -1.515126 2.61424 -0.302379
C  -0.329969 2.988609 -0.867983
C  -1.4576 -0.462166 -0.2877
C  1.999014 0.163276 0.330424
C  -2.624616 -1.243297 1.838192
C  -3.344306 -2.042015 -0.449124
C  3.873471 -1.405209 0.030049
C  2.150454 -1.216511 -1.813875
C  -1.868123 -2.414948 2.505005
C  -4.607227 -1.280381 -0.903828
C  3.592036 -2.706478 0.811825
C  2.748652 -0.400645 -2.980873
H  -1.994798 1.760951 1.718063
H  1.788905 2.891166 -0.09587
H  -0.256721 -0.079774 1.490917
H  0.607159 0.673048 -1.283543
H  -0.059082 3.616719 1.720231
H  0.691593 2.034374 2.208821
H  -2.517842 2.729898 -0.721594
H  -0.181679 3.464141 -1.841321
H  -3.709461 -1.338174 2.037189
H  -2.30972 -0.287589 2.286121
H  -2.778398 -2.378461 -1.334016
H  -3.618802 -2.930261 0.150517
H  4.372309 -0.679237 0.693724
H  4.535944 -1.605274 -0.83336
H  1.048267 -1.181169 -1.849263
H  2.434382 -2.281113 -1.92137
H  -2.076778 -2.440517 3.590429
H  -0.777253 -2.311356 2.36609
H  -2.176137 -3.384479 2.07391
H  -5.1820 -0.896807 -0.040484
H  -4.322107 -0.427943 -1.543443
H  -5.269532 -1.945933 -1.487743
H  4.539896 -3.166738 1.147162
H  3.054635 -3.445758 0.189257
H  2.980929 -2.484663 1.703232
H  2.406766 -0.810282 -3.949121
H  3.853609 -0.426654 -2.964979
H  2.430444 0.655633 -2.92462
