program: Orca
programVersion: 5.0.2
elementType: Cl Cl F F F F O O C C C C C C C C C C C C C C C H H H H H H H H H H H H
charge: 0
multiplicity: 1
keywords: wb97x-d3
keywords: def2-TZVPP
keywords: def2/J RIJCOSX
keywords: DEFGRID2
keywords: scfconv7
keywords: smallprint printgap noloewdin
keywords: NOSOSCF
formula: C15H12Cl2F4O2
InChI: InChI=1/C15H12Cl2F4O2/c1-15(2)7(3-10(16)17)11(15)14(22)23-5-6-12(20)8(18)4-9(19)13(6)21/h3-4,7,11H,5H2,1-2H3
35 atoms
Cl -3.781228 1.87361 -0.471127
Cl -5.973874 0.485221 -1.739429
F  3.538138 2.603106 -0.85798
F  1.979964 -1.191556 1.450566
F  4.258039 -2.470106 0.880052
F  5.816599 1.3328 -1.396687
O  0.319921 0.682879 0.079785
O  -0.743164 0.509883 2.047981
C  -2.000749 -1.992509 0.563051
C  -1.601761 -0.594189 0.107929
C  -2.974879 -0.868821 0.669947
C  -1.435289 -2.588209 1.827742
C  -2.166876 -3.000133 -0.547732
C  -4.157596 -0.767711 -0.213567
C  -0.660703 0.243112 0.874766
C  -4.579863 0.374306 -0.736861
C  1.396004 1.433843 0.639236
C  2.685913 0.740087 0.30991
C  3.692825 1.353872 -0.416641
C  2.914087 -0.560466 0.737047
C  4.091223 -1.220481 0.447474
C  4.877116 0.695691 -0.698608
C  5.089775 -0.597292 -0.273087
H  -1.532567 -0.477304 -0.967826
H  -3.134948 -0.489477 1.676611
H  -1.359663 -1.873681 2.644665
H  -2.079487 -3.401982 2.166919
H  -0.443758 -3.009011 1.651522
H  -2.544548 -2.55363 -1.468368
H  -1.210296 -3.4716 -0.780194
H  -2.859594 -3.790233 -0.250087
H  -4.729521 -1.664312 -0.42521
H  1.288711 1.543081 1.718645
H  1.363338 2.43075 0.204012
H  6.016435 -1.110615 -0.496592
elementType: Cl F O C H
totalener: -2049.16561726 hartree
nucrepener: 2239.00745607 hartree
electener: -4288.17307333 hartree
oneelecener: -7274.52542060 hartree
twoeener: 2986.35234727 hartree
cpcmener: -0.01923972 hartree
kineticenergy: 2043.53721121 hartree
xcener: -143.163268598449 hartree
chargesum: -0.0000000
charge: -0.050709 -0.056871 -0.202385 -0.201836 -0.201185 -0.201545 -0.281287 -0.452774 0.136374 -0.136418 -0.036038 -0.274481 -0.279249 -0.213967 0.400351 0.071927 0.070730 -0.117489 0.225670 0.231705 0.195112 0.202008 -0.168549 0.110948 0.111191 0.095514 0.099548 0.094178 0.093672 0.099549 0.100433 0.139666 0.128298 0.114368 0.153541
qa: -0.0507 -0.0569 -0.2024 -0.2018 -0.2012 -0.2015 -0.2813 -0.4528 0.1364 -0.1364 -0.0360 -0.2745 -0.2792 -0.2140 0.4004 0.0719 0.0707 -0.1175 0.2257 0.2317 0.1951 0.2020 -0.1685 0.1109 0.1112 0.0955 0.0995 0.0942 0.0937 0.0995 0.1004 0.1397 0.1283 0.1144 0.1535
va: 1.2797 1.2493 1.0978 1.0989 1.0881 1.0874 2.1132 2.0567 3.7150 3.8240 3.8805 3.8885 3.9135 3.9010 4.1681 4.1884 3.8247 3.6300 3.9103 3.8700 3.9885 3.9605 3.8680 1.0250 1.0246 1.0175 1.0023 1.0056 0.9990 1.0031 1.0000 1.0083 1.0200 1.0102 0.9986
dispcorr: -0.017672547 hartree
energy: -2049.183289809567
dipole: -11.81786 12.37656 0.55870 -20.18751 19.06607 -1.12144 8.22033 -8.69596 -0.47564
magnitude: 1.34015 au
magnitude: 3.40640 debye
