program: Orca
programVersion: 5.0.2
elementType: Cl Cl F F F F O O C C C C C C C C C C C C C C C H H H H H H H H H H H H
charge: 0
multiplicity: 1
keywords: wb97x-d3
keywords: def2-TZVPP
keywords: def2/J RIJCOSX
keywords: DEFGRID2
keywords: scfconv7
keywords: smallprint printgap noloewdin
keywords: NOSOSCF
formula: C15H12Cl2F4O2
InChI: InChI=1/C15H12Cl2F4O2/c1-15(2)7(3-10(16)17)11(15)14(22)23-5-6-12(20)8(18)4-9(19)13(6)21/h3-4,7,11H,5H2,1-2H3
35 atoms
Cl -1.243626 1.816173 -0.052779
Cl -3.939003 2.860446 -0.004299
F  1.315795 0.158472 2.287462
F  3.375819 -1.600602 -1.559308
F  4.508667 0.761575 -2.031848
F  2.467874 2.530133 1.809742
O  0.183113 -1.922331 0.511555
O  0.361379 -1.744345 -1.705328
C  -2.853311 -2.252198 -0.068292
C  -1.760911 -1.420231 -0.72426
C  -2.499292 -0.919018 0.497461
C  -2.517879 -3.494531 0.718347
C  -4.119493 -2.387247 -0.879331
C  -3.383319 0.259795 0.364773
C  -0.3165 -1.718878 -0.706337
C  -2.921106 1.480678 0.136823
C  1.595776 -2.089405 0.629464
C  2.303322 -0.789293 0.374698
C  2.098001 0.294927 1.216266
C  3.132247 -0.598911 -0.717899
C  3.72866 0.625502 -0.959449
C  2.694142 1.516913 0.973969
C  3.515762 1.696364 -0.11921
H  -2.055465 -0.977275 -1.669303
H  -1.927077 -0.940944 1.420994
H  -2.308725 -4.332357 0.050556
H  -1.663909 -3.370409 1.380291
H  -3.370557 -3.776226 1.339038
H  -4.044457 -3.23142 -1.567045
H  -4.976334 -2.568655 -0.227399
H  -4.33531 -1.499168 -1.474526
H  -4.453963 0.132985 0.478401
H  1.95418 -2.876738 -0.032002
H  1.757546 -2.424451 1.652396
H  3.98289 2.654388 -0.309076
elementType: Cl F O C H
totalener: -2049.16421472 hartree
nucrepener: 2357.86523381 hartree
electener: -4407.02944853 hartree
oneelecener: -7512.66830154 hartree
twoeener: 3105.63885301 hartree
cpcmener: -0.02185333 hartree
kineticenergy: 2043.55695548 hartree
xcener: -143.167189819148 hartree
chargesum: 0.0000000
charge: -0.057438 -0.056493 -0.201203 -0.200369 -0.202353 -0.202378 -0.269715 -0.452177 0.130621 -0.140334 -0.007700 -0.268698 -0.284097 -0.238337 0.400945 0.087376 0.057920 -0.142590 0.177934 0.280454 0.191567 0.206862 -0.167194 0.111364 0.113708 0.101440 0.093547 0.094638 0.099770 0.101114 0.093327 0.139661 0.121590 0.133588 0.153647
qa: -0.0574 -0.0565 -0.2012 -0.2004 -0.2024 -0.2024 -0.2697 -0.4522 0.1306 -0.1403 -0.0077 -0.2687 -0.2841 -0.2383 0.4009 0.0874 0.0579 -0.1426 0.1779 0.2805 0.1916 0.2069 -0.1672 0.1114 0.1137 0.1014 0.0935 0.0946 0.0998 0.1011 0.0933 0.1397 0.1216 0.1336 0.1536
va: 1.2827 1.2501 1.0938 1.0988 1.0868 1.0852 2.1092 2.0621 3.7281 3.8427 3.8313 3.8931 3.9160 3.9037 4.1578 4.1735 3.8430 3.5821 3.9120 3.8677 3.9643 3.9377 3.8709 1.0218 1.0213 0.9995 1.0139 1.0015 1.0025 0.9995 0.9995 1.0086 1.0174 0.9976 0.9985
dispcorr: -0.019585100 hartree
energy: -2049.183799816002
dipole: -24.08596 23.25016 -0.83580 -29.83641 28.81199 -1.02442 0.58916 0.58586 1.17502
magnitude: 1.76880 au
magnitude: 4.49594 debye
