program: Orca
programVersion: 5.0.2
elementType: Cl Cl F F F F O O C C C C C C C C C C C C C C C H H H H H H H H H H H H
charge: 0
multiplicity: 1
keywords: wb97x-d3
keywords: def2-TZVPP
keywords: def2/J RIJCOSX
keywords: DEFGRID2
keywords: scfconv7
keywords: smallprint printgap noloewdin
keywords: NOSOSCF
formula: C15H12Cl2F4O2
InChI: InChI=1/C15H12Cl2F4O2/c1-15(2)7(3-10(16)17)11(15)14(22)23-5-6-12(20)8(18)4-9(19)13(6)21/h3-4,7,11H,5H2,1-2H3
35 atoms
Cl -1.483089 0.227077 1.725748
Cl -4.125896 -0.464367 2.660436
F  3.580419 1.690099 -1.690211
F  1.173556 -1.675749 0.551238
F  2.186217 -0.842187 2.880841
F  4.668345 2.443122 0.628613
O  0.342377 -0.607599 -1.879839
O  0.11611 1.60977 -1.816376
C  -2.698248 -0.678716 -2.359987
C  -1.81584 0.268258 -1.55921
C  -2.328555 -1.022268 -0.957511
C  -2.137915 -1.506022 -3.490971
C  -4.089897 -0.161769 -2.63515
C  -3.298936 -0.97349 0.158429
C  -0.375808 0.507663 -1.771901
C  -3.010106 -0.47144 1.35064
C  1.758998 -0.489648 -1.942903
C  2.338925 -0.014008 -0.639528
C  3.230415 1.043968 -0.577733
C  2.011556 -0.640055 0.554708
C  2.542293 -0.217798 1.758263
C  3.787273 1.443227 0.623918
C  3.442705 0.825217 1.805894
H  -2.320985 1.172881 -1.239831
H  -1.586238 -1.80911 -0.855188
H  -2.848579 -2.292123 -3.75348
H  -1.983307 -0.894809 -4.382158
H  -1.196067 -1.991807 -3.247408
H  -4.787401 -0.991372 -2.76777
H  -4.470686 0.467887 -1.830201
H  -4.104862 0.431104 -3.551354
H  -4.283768 -1.403585 0.013614
H  2.059544 0.15353 -2.769186
H  2.114731 -1.49484 -2.166019
H  3.869174 1.147935 2.747012
elementType: Cl F O C H
totalener: -2049.16315147 hartree
nucrepener: 2359.57447486 hartree
electener: -4408.73762633 hartree
oneelecener: -7516.09810685 hartree
twoeener: 3107.36048053 hartree
cpcmener: -0.02193945 hartree
kineticenergy: 2043.55723128 hartree
xcener: -143.167812241401 hartree
chargesum: 0.0000000
charge: -0.055993 -0.057213 -0.202602 -0.197374 -0.202425 -0.202419 -0.268908 -0.452157 0.136662 -0.134867 -0.002640 -0.271475 -0.283045 -0.254383 0.390480 0.097784 0.054513 -0.102296 0.252765 0.165002 0.206588 0.194612 -0.168802 0.112220 0.111652 0.093968 0.101874 0.094265 0.100706 0.093465 0.100145 0.139612 0.125059 0.131892 0.153335
qa: -0.0560 -0.0572 -0.2026 -0.1974 -0.2024 -0.2024 -0.2689 -0.4522 0.1367 -0.1349 -0.0026 -0.2715 -0.2830 -0.2544 0.3905 0.0978 0.0545 -0.1023 0.2528 0.1650 0.2066 0.1946 -0.1688 0.1122 0.1117 0.0940 0.1019 0.0943 0.1007 0.0935 0.1001 0.1396 0.1251 0.1319 0.1533
va: 1.2835 1.2491 1.0966 1.0952 1.0862 1.0861 2.1051 2.0585 3.7158 3.8576 3.8187 3.8977 3.9177 3.9142 4.1508 4.1671 3.8531 3.5476 3.9033 3.9161 3.9540 3.9566 3.8701 1.0218 1.0228 1.0013 0.9992 1.0132 0.9996 0.9997 1.0024 1.0097 1.0156 0.9960 0.9985
dispcorr: -0.019727203 hartree
energy: -2049.182878674848
dipole: -21.57211 21.06919 -0.50292 -8.27859 6.74332 -1.53527 -30.48321 29.52212 -0.96109
magnitude: 1.87981 au
magnitude: 4.77809 debye
