program: Orca
programVersion: 5.0.2
elementType: Cl Cl F F F F O O C C C C C C C C C C C C C C C H H H H H H H H H H H H
charge: 0
multiplicity: 1
keywords: wb97x-d3
keywords: def2-TZVPP
keywords: def2/J RIJCOSX
keywords: DEFGRID2
keywords: scfconv7
keywords: smallprint printgap noloewdin
keywords: NOSOSCF
formula: C15H12Cl2F4O2
InChI: InChI=1/C15H12Cl2F4O2/c1-15(2)7(3-10(16)17)11(15)14(22)23-5-6-12(20)8(18)4-9(19)13(6)21/h3-4,7,11H,5H2,1-2H3
35 atoms
Cl -1.430631 1.886673 -0.076283
Cl -4.169609 2.79903 0.029973
F  1.132733 0.512273 2.032663
F  3.611401 -1.883448 -1.17321
F  4.953606 0.330033 -1.78665
F  2.453118 2.740345 1.380802
O  0.147606 -1.77802 0.619755
O  0.419815 -1.73406 -1.593479
C  -2.841962 -2.241154 -0.16484
C  -1.742088 -1.346025 -0.716682
C  -2.563042 -0.923348 0.477824
C  -2.501917 -3.506233 0.582619
C  -4.060194 -2.377647 -1.045506
C  -3.490222 0.223717 0.355892
C  -0.298108 -1.641206 -0.627417
C  -3.086555 1.465627 0.129689
C  1.545489 -1.982706 0.808296
C  2.328186 -0.751993 0.448584
C  2.064507 0.45396 1.080927
C  3.311526 -0.757735 -0.526416
C  4.00899 0.391928 -0.847226
C  2.75071 1.604806 0.748827
C  3.734149 1.586815 -0.218358
H  -1.990057 -0.874852 -1.661564
H  -2.051183 -0.972338 1.435085
H  -3.370566 -3.842909 1.151612
H  -2.234823 -4.305975 -0.110374
H  -1.682287 -3.384451 1.287556
H  -3.92371 -3.184063 -1.768038
H  -4.941229 -2.61755 -0.446722
H  -4.276744 -1.467967 -1.606776
H  -4.552372 0.051915 0.491528
H  1.889797 -2.852997 0.251244
H  1.6568 -2.20856 1.867475
H  4.276913 2.487332 -0.474633
elementType: Cl F O C H
totalener: -2049.16420753 hartree
nucrepener: 2346.01371659 hartree
electener: -4395.17792412 hartree
oneelecener: -7488.98408791 hartree
twoeener: 3093.80616378 hartree
cpcmener: -0.02206263 hartree
kineticenergy: 2043.55699745 hartree
xcener: -143.167323897462 hartree
chargesum: -0.0000000
charge: -0.056109 -0.057437 -0.200675 -0.203031 -0.203040 -0.203139 -0.268887 -0.452072 0.126436 -0.153953 0.007517 -0.269027 -0.284216 -0.250219 0.409796 0.091502 0.051098 -0.126569 0.186042 0.267723 0.193773 0.201227 -0.168276 0.115189 0.111026 0.095343 0.101854 0.093267 0.099982 0.100727 0.093808 0.139072 0.123372 0.134466 0.153430
qa: -0.0561 -0.0574 -0.2007 -0.2030 -0.2030 -0.2031 -0.2689 -0.4521 0.1264 -0.1540 0.0075 -0.2690 -0.2842 -0.2502 0.4098 0.0915 0.0511 -0.1266 0.1860 0.2677 0.1938 0.2012 -0.1683 0.1152 0.1110 0.0953 0.1019 0.0933 0.1000 0.1007 0.0938 0.1391 0.1234 0.1345 0.1534
va: 1.2824 1.2487 1.0944 1.0957 1.0859 1.0859 2.1081 2.0619 3.7324 3.8547 3.8152 3.8963 3.9150 3.9073 4.1440 4.1725 3.8498 3.5803 3.9116 3.8775 3.9605 3.9595 3.8682 1.0212 1.0222 1.0017 0.9993 1.0136 1.0026 0.9997 0.9993 1.0092 1.0158 0.9961 0.9986
dispcorr: -0.019375714 hartree
energy: -2049.183583243047
dipole: -23.75270 22.92179 -0.83090 -29.67027 28.64543 -1.02484 0.04904 1.11933 1.16837
magnitude: 1.76233 au
magnitude: 4.47948 debye
