program: Orca
programVersion: 5.0.2
elementType: Cl Cl F F F F O O C C C C C C C C C C C C C C C H H H H H H H H H H H H
charge: 0
multiplicity: 1
keywords: wb97x-d3
keywords: def2-TZVPP
keywords: def2/J RIJCOSX
keywords: DEFGRID2
keywords: scfconv7
keywords: smallprint printgap noloewdin
keywords: NOSOSCF
formula: C15H12Cl2F4O2
InChI: InChI=1/C15H12Cl2F4O2/c1-15(2)7(3-10(16)17)11(15)14(22)23-5-6-12(20)8(18)4-9(19)13(6)21/h3-4,7,11H,5H2,1-2H3
35 atoms
Cl -3.742195 1.957755 1.334607
Cl -6.154884 0.910361 0.14724
F  3.008452 2.698597 -0.071661
F  2.349858 -1.868597 -0.979468
F  4.25975 -2.492985 0.794712
F  4.933395 2.070319 1.672051
O  0.307584 0.214954 -1.111882
O  -0.002269 -0.987235 -2.976221
C  -1.717717 -1.812828 0.09091
C  -1.611511 -1.146053 -1.265195
C  -2.318557 -0.450208 -0.118033
C  -0.526477 -1.921569 1.01085
C  -2.612641 -3.027641 0.154136
C  -3.768468 -0.245393 -0.223548
C  -0.359989 -0.649372 -1.874734
C  -4.450865 0.74245 0.341747
C  1.54985 0.747797 -1.574008
C  2.621377 0.429155 -0.573496
C  3.301389 1.412925 0.125073
C  2.974129 -0.888996 -0.323535
C  3.959446 -1.211737 0.587233
C  4.298261 1.090115 1.029795
C  4.635716 -0.223051 1.272272
H  -2.259509 -1.581081 -2.018133
H  -1.766359 0.358217 0.345854
H  -0.871762 -2.161739 2.018179
H  0.137413 -2.727816 0.69444
H  0.055345 -1.005453 1.081415
H  -3.056784 -3.126545 1.146353
H  -3.422284 -3.001123 -0.574352
H  -2.032071 -3.931247 -0.040166
H  -4.336587 -0.946976 -0.822934
H  1.420567 1.822595 -1.684082
H  1.814105 0.346981 -2.552404
H  5.414084 -0.473254 1.981753
elementType: Cl F O C H
totalener: -2049.16567273 hartree
nucrepener: 2243.89170490 hartree
electener: -4293.05737764 hartree
oneelecener: -7283.58650809 hartree
twoeener: 2990.52913045 hartree
cpcmener: -0.02127244 hartree
kineticenergy: 2043.53321580 hartree
xcener: -143.163882759548 hartree
chargesum: 0.0000000
charge: -0.056888 -0.060738 -0.201811 -0.201351 -0.201311 -0.201269 -0.273990 -0.452340 0.087357 -0.108929 0.062544 -0.271778 -0.265435 -0.220694 0.417214 0.043130 0.044909 -0.110780 0.227436 0.214439 0.211477 0.200709 -0.170825 0.095465 0.083861 0.101019 0.099282 0.087285 0.099743 0.090216 0.099006 0.129206 0.114928 0.135558 0.153357
qa: -0.0569 -0.0607 -0.2018 -0.2014 -0.2013 -0.2013 -0.2740 -0.4523 0.0874 -0.1089 0.0625 -0.2718 -0.2654 -0.2207 0.4172 0.0431 0.0449 -0.1108 0.2274 0.2144 0.2115 0.2007 -0.1708 0.0955 0.0839 0.1010 0.0993 0.0873 0.0997 0.0902 0.0990 0.1292 0.1149 0.1356 0.1534
va: 1.2688 1.2444 1.0998 1.0982 1.0895 1.0876 2.1144 2.0563 3.7265 3.8387 3.8163 3.9045 3.9091 3.8901 4.1971 4.2118 3.8376 3.6077 3.9209 3.8465 3.9879 3.9553 3.8712 1.0310 1.0435 1.0020 1.0047 1.0137 1.0012 1.0060 1.0010 1.0191 1.0116 1.0195 0.9987
dispcorr: -0.017909856 hartree
energy: -2049.183582588176
dipole: -8.45802 9.01561 0.55760 -19.57871 19.09373 -0.48498 -3.72586 4.50325 0.77739
magnitude: 1.07259 au
magnitude: 2.72631 debye
