program: Orca
programVersion: 5.0.2
elementType: Cl Cl F F F F O O C C C C C C C C C C C C C C C H H H H H H H H H H H H
charge: 0
multiplicity: 1
keywords: wb97x-d3
keywords: def2-TZVPP
keywords: def2/J RIJCOSX
keywords: DEFGRID2
keywords: scfconv7
keywords: smallprint printgap noloewdin
keywords: NOSOSCF
formula: C15H12Cl2F4O2
InChI: InChI=1/C15H12Cl2F4O2/c1-15(2)7(3-10(16)17)11(15)14(22)23-5-6-12(20)8(18)4-9(19)13(6)21/h3-4,7,11H,5H2,1-2H3
35 atoms
Cl -1.637675 -0.525158 1.854797
Cl -4.318385 0.163491 2.683116
F  3.474674 1.812354 -1.952163
F  1.626784 -1.425212 0.914812
F  2.854402 -0.272079 2.99872
F  4.694018 2.954674 0.123696
O  0.427158 -0.165516 -1.627703
O  -0.237314 -2.304555 -1.737404
C  -3.051663 -0.975652 -2.237198
C  -1.835549 -0.551076 -1.425945
C  -2.922897 -1.403655 -0.815644
C  -2.936396 -2.016584 -3.321713
C  -4.009565 0.139765 -2.57967
C  -3.771614 -0.844412 0.258832
C  -0.492686 -1.131634 -1.614379
C  -3.304519 -0.455328 1.436373
C  1.812893 -0.498259 -1.729475
C  2.526803 0.149188 -0.58047
C  3.313471 1.277066 -0.742021
C  2.385305 -0.348649 0.706707
C  3.013836 0.247354 1.781888
C  3.944878 1.873663 0.334997
C  3.802014 1.366543 1.607572
H  -1.83312 0.494472 -1.1397
H  -2.652338 -2.446929 -0.670996
H  -2.515747 -1.586892 -4.232561
H  -2.324948 -2.869089 -3.036242
H  -3.929771 -2.396222 -3.567839
H  -4.05607 0.907589 -1.806488
H  -3.711283 0.627458 -3.509398
H  -5.019111 -0.251161 -2.722893
H  -4.840537 -0.774005 0.092333
H  2.176111 -0.119991 -2.683295
H  1.969668 -1.57631 -1.725129
H  4.293579 1.833867 2.451297
elementType: Cl F O C H
totalener: -2049.16548843 hartree
nucrepener: 2290.91013223 hartree
electener: -4340.07562065 hartree
oneelecener: -7378.59751631 hartree
twoeener: 3038.52189566 hartree
cpcmener: -0.01977102 hartree
kineticenergy: 2043.55021478 hartree
xcener: -143.165057516120 hartree
chargesum: 0.0000000
charge: -0.055014 -0.058244 -0.201879 -0.201445 -0.200968 -0.201445 -0.273699 -0.458931 0.133002 -0.152833 -0.026146 -0.274448 -0.277812 -0.225444 0.409902 0.086680 0.070443 -0.144289 0.234393 0.248070 0.195924 0.193489 -0.162342 0.114751 0.109297 0.099522 0.094370 0.095336 0.093530 0.100050 0.100856 0.138376 0.114977 0.128327 0.153642
qa: -0.0550 -0.0582 -0.2019 -0.2014 -0.2010 -0.2014 -0.2737 -0.4589 0.1330 -0.1528 -0.0261 -0.2744 -0.2778 -0.2254 0.4099 0.0867 0.0704 -0.1443 0.2344 0.2481 0.1959 0.1935 -0.1623 0.1148 0.1093 0.0995 0.0944 0.0953 0.0935 0.1000 0.1009 0.1384 0.1150 0.1283 0.1536
va: 1.2869 1.2471 1.0998 1.0987 1.0886 1.0874 2.1193 2.0510 3.7086 3.8316 3.8666 3.8957 3.9146 3.9105 4.1660 4.1788 3.8060 3.6486 3.9194 3.8521 3.9851 3.9607 3.8626 1.0249 1.0246 0.9989 1.0190 1.0014 0.9990 1.0026 0.9997 1.0099 1.0081 1.0218 0.9983
dispcorr: -0.017956323 hartree
energy: -2049.183444750548
dipole: -24.66405 24.24442 -0.41964 -9.51597 10.17435 0.65838 -29.45067 28.59706 -0.85361
magnitude: 1.15681 au
magnitude: 2.94038 debye
