program: Orca
programVersion: 5.0.2
elementType: Cl Cl F F F F O O C C C C C C C C C C C C C C C H H H H H H H H H H H H
charge: 0
multiplicity: 1
keywords: wb97x-d3
keywords: def2-TZVPP
keywords: def2/J RIJCOSX
keywords: DEFGRID2
keywords: scfconv7
keywords: smallprint printgap noloewdin
keywords: NOSOSCF
formula: C15H12Cl2F4O2
InChI: InChI=1/C15H12Cl2F4O2/c1-15(2)7(3-10(16)17)11(15)14(22)23-5-6-12(20)8(18)4-9(19)13(6)21/h3-4,7,11H,5H2,1-2H3
35 atoms
Cl -1.751188 -0.444783 1.813377
Cl -4.476022 0.081758 2.606909
F  4.102854 1.566776 -1.850457
F  1.164149 -0.993056 0.786359
F  2.499698 -0.260057 2.982019
F  5.475471 2.23174 0.33971
O  0.446638 0.199375 -1.66285
O  -0.244454 -1.916308 -1.941626
C  -3.024527 -0.503275 -2.348592
C  -1.824244 -0.186221 -1.466231
C  -2.928817 -1.096214 -0.984094
C  -2.891504 -1.408899 -3.546946
C  -3.966219 0.654203 -2.574672
C  -3.8192 -0.668326 0.117905
C  -0.487655 -0.757094 -1.715356
C  -3.402596 -0.382899 1.343195
C  1.819656 -0.154141 -1.816293
C  2.581357 0.275215 -0.595514
C  3.690694 1.101551 -0.670197
C  2.209896 -0.174771 0.662846
C  2.905538 0.193191 1.796521
C  4.401612 1.452372 0.463991
C  4.014412 1.008893 1.709188
H  -1.815242 0.820111 -1.063665
H  -2.66655 -2.15146 -0.958661
H  -2.449337 -0.878272 -4.392394
H  -2.290622 -2.294607 -3.352746
H  -3.88137 -1.750335 -3.856327
H  -4.974639 0.295732 -2.790992
H  -4.026692 1.31931 -1.71245
H  -3.639439 1.25144 -3.427893
H  -4.884769 -0.61759 -0.077611
H  2.189123 0.352283 -2.706036
H  1.940774 -1.226048 -1.975563
H  4.569479 1.289641 2.595276
elementType: Cl F O C H
totalener: -2049.16444513 hartree
nucrepener: 2293.10774196 hartree
electener: -4342.27218709 hartree
oneelecener: -7383.07034388 hartree
twoeener: 3040.79815679 hartree
cpcmener: -0.01932470 hartree
kineticenergy: 2043.54872015 hartree
xcener: -143.165556241305 hartree
chargesum: -0.0000000
charge: -0.051972 -0.059474 -0.202715 -0.202880 -0.200873 -0.201532 -0.281677 -0.455309 0.129347 -0.146089 -0.023520 -0.272648 -0.278524 -0.232874 0.406432 0.088529 0.078445 -0.107318 0.217526 0.227307 0.195283 0.204402 -0.170842 0.115036 0.108091 0.099688 0.094322 0.095517 0.100661 0.093777 0.100144 0.138079 0.115997 0.126214 0.153449
qa: -0.0520 -0.0595 -0.2027 -0.2029 -0.2009 -0.2015 -0.2817 -0.4553 0.1293 -0.1461 -0.0235 -0.2726 -0.2785 -0.2329 0.4064 0.0885 0.0784 -0.1073 0.2175 0.2273 0.1953 0.2044 -0.1708 0.1150 0.1081 0.0997 0.0943 0.0955 0.1007 0.0938 0.1001 0.1381 0.1160 0.1262 0.1534
va: 1.2930 1.2457 1.0971 1.0984 1.0889 1.0873 2.1156 2.0545 3.7101 3.8241 3.8641 3.8969 3.9147 3.9119 4.1788 4.1807 3.8210 3.6276 3.9154 3.8648 3.9976 3.9599 3.8659 1.0256 1.0259 0.9989 1.0186 1.0013 1.0002 0.9986 1.0027 1.0102 1.0088 1.0216 0.9988
dispcorr: -0.017987956 hartree
energy: -2049.182433082414
dipole: -24.52473 24.14441 -0.38032 -5.22001 5.90799 0.68798 -30.36274 29.50694 -0.85579
magnitude: 1.16204 au
magnitude: 2.95367 debye
