program: Orca
programVersion: 5.0.2
elementType: Cl Cl F F F F O O C C C C C C C C C C C C C C C H H H H H H H H H H H H
charge: 0
multiplicity: 1
keywords: wb97x-d3
keywords: def2-TZVPP
keywords: def2/J RIJCOSX
keywords: DEFGRID2
keywords: scfconv7
keywords: smallprint printgap noloewdin
keywords: NOSOSCF
formula: C15H12Cl2F4O2
InChI: InChI=1/C15H12Cl2F4O2/c1-15(2)7(3-10(16)17)11(15)14(22)23-5-6-12(20)8(18)4-9(19)13(6)21/h3-4,7,11H,5H2,1-2H3
35 atoms
Cl -4.308454 -1.152767 1.980348
Cl -5.045484 1.635111 2.059067
F  3.085557 1.90078 -1.778687
F  2.787537 -2.182959 0.54034
F  4.244479 -1.157623 2.52231
F  4.553951 2.919749 0.213874
O  0.800111 -0.103325 -1.852305
O  -0.126691 -1.824572 -0.759557
C  -2.668459 -0.398933 -2.102115
C  -1.446652 0.08449 -1.348199
C  -2.681878 -0.359543 -0.598261
C  -2.670549 -1.754789 -2.762683
C  -3.420165 0.645958 -2.889888
C  -3.457514 0.637595 0.147983
C  -0.217585 -0.733626 -1.264477
C  -4.1671 0.3974 1.243399
C  2.09361 -0.709012 -1.833826
C  2.900129 -0.171153 -0.686883
C  3.362982 1.13636 -0.722144
C  3.206203 -0.923263 0.436293
C  3.962744 -0.393077 1.467307
C  4.118197 1.663935 0.305667
C  4.42543 0.903236 1.414756
H  -1.2702 1.152779 -1.411873
H  -2.597646 -1.332318 -0.127287
H  -3.698324 -2.068594 -2.955153
H  -2.152941 -1.718559 -3.723508
H  -2.203933 -2.529732 -2.157036
H  -3.336132 1.645842 -2.465577
H  -3.037006 0.695115 -3.910794
H  -4.481034 0.394286 -2.946722
H  -3.452761 1.659571 -0.212265
H  2.559369 -0.441322 -2.781133
H  2.027846 -1.794531 -1.801618
H  5.017641 1.313717 2.222869
elementType: Cl F O C H
totalener: -2049.16836856 hartree
nucrepener: 2204.26991152 hartree
electener: -4253.43828008 hartree
oneelecener: -7205.04174826 hartree
twoeener: 2951.60346818 hartree
cpcmener: -0.02198293 hartree
kineticenergy: 2043.53699333 hartree
xcener: -143.162997921484 hartree
chargesum: 0.0000000
charge: -0.056299 -0.061362 -0.200933 -0.199709 -0.201606 -0.202023 -0.273055 -0.453718 0.081742 -0.088030 0.030800 -0.260929 -0.262623 -0.204871 0.405934 0.041262 0.070371 -0.187822 0.226411 0.292807 0.185238 0.185693 -0.155486 0.099003 0.075528 0.098392 0.099800 0.092603 0.089927 0.097794 0.101305 0.129569 0.136636 0.113390 0.154259
qa: -0.0563 -0.0614 -0.2009 -0.1997 -0.2016 -0.2020 -0.2731 -0.4537 0.0817 -0.0880 0.0308 -0.2609 -0.2626 -0.2049 0.4059 0.0413 0.0704 -0.1878 0.2264 0.2928 0.1852 0.1857 -0.1555 0.0990 0.0755 0.0984 0.0998 0.0926 0.0899 0.0978 0.1013 0.1296 0.1366 0.1134 0.1543
va: 1.2689 1.2434 1.1011 1.0996 1.0870 1.0868 2.1322 2.0619 3.7579 3.8063 3.8537 3.9063 3.9054 3.8990 4.2183 4.2097 3.8112 3.6455 3.9341 3.8419 3.9720 3.9591 3.8533 1.0301 1.0528 1.0004 0.9999 1.0175 1.0057 1.0019 1.0009 1.0183 0.9963 1.0296 0.9981
dispcorr: -0.016378581 hartree
energy: -2049.184747139622
dipole: -16.37841 16.92346 0.54505 -5.03741 5.89279 0.85538 -27.70201 26.18257 -1.51945
magnitude: 1.82687 au
magnitude: 4.64354 debye
