program: Orca
programVersion: 5.0.2
elementType: Cl Cl F F F F O O C C C C C C C C C C C C C C C H H H H H H H H H H H H
charge: 0
multiplicity: 1
keywords: wb97x-d3
keywords: def2-TZVPP
keywords: def2/J RIJCOSX
keywords: DEFGRID2
keywords: scfconv7
keywords: smallprint printgap noloewdin
keywords: NOSOSCF
formula: C15H12Cl2F4O2
InChI: InChI=1/C15H12Cl2F4O2/c1-15(2)7(3-10(16)17)11(15)14(22)23-5-6-12(20)8(18)4-9(19)13(6)21/h3-4,7,11H,5H2,1-2H3
35 atoms
Cl -2.116215 1.356756 2.151987
Cl -4.241137 2.696742 0.733706
F  0.979517 1.554518 -1.009644
F  4.119393 -1.946031 -0.787941
F  5.084439 -0.931261 1.486527
F  1.910334 2.520851 1.297507
O  0.525326 -0.819258 -2.261351
O  0.405943 -2.085314 -0.427475
C  -2.681688 -2.056299 -0.880357
C  -1.586399 -1.159337 -1.401634
C  -2.34511 -0.80886 -0.121052
C  -2.377952 -3.378952 -0.220011
C  -3.929631 -2.101744 -1.730691
C  -3.205188 0.379217 -0.116225
C  -0.142514 -1.437109 -1.283871
C  -3.183647 1.338032 0.801933
C  1.946819 -0.844616 -2.218707
C  2.5054 -0.242241 -0.956869
C  1.982768 0.916851 -0.40371
C  3.563629 -0.839701 -0.291606
C  4.067507 -0.314807 0.883087
C  2.470839 1.426339 0.784456
C  3.521534 0.820843 1.439795
H  -1.851638 -0.569922 -2.271932
H  -1.774774 -0.976899 0.785557
H  -1.565513 -3.326724 0.49966
H  -3.265364 -3.724656 0.312444
H  -2.125119 -4.138143 -0.962165
H  -3.85241 -2.906993 -2.463086
H  -4.810048 -2.295871 -1.115629
H  -4.104648 -1.180828 -2.285965
H  -3.913809 0.499305 -0.926921
H  2.262579 -0.265642 -3.086018
H  2.309845 -1.863108 -2.354963
H  3.908741 1.228695 2.364636
elementType: Cl F O C H
totalener: -2049.16548366 hartree
nucrepener: 2313.68977485 hartree
electener: -4362.85525851 hartree
oneelecener: -7424.40785993 hartree
twoeener: 3061.55260142 hartree
cpcmener: -0.02093207 hartree
kineticenergy: 2043.55257853 hartree
xcener: -143.167999229135 hartree
chargesum: 0.0000000
charge: -0.056021 -0.059624 -0.201178 -0.203717 -0.202915 -0.203088 -0.282130 -0.451397 0.108946 -0.051855 -0.010491 -0.270004 -0.280215 -0.178292 0.376651 0.036474 0.072297 -0.098569 0.200203 0.228777 0.198691 0.196773 -0.176623 0.096276 0.087490 0.095241 0.095344 0.099000 0.099265 0.103686 0.091768 0.127000 0.133963 0.124726 0.153552
qa: -0.0560 -0.0596 -0.2012 -0.2037 -0.2029 -0.2031 -0.2821 -0.4514 0.1089 -0.0519 -0.0105 -0.2700 -0.2802 -0.1783 0.3767 0.0365 0.0723 -0.0986 0.2002 0.2288 0.1987 0.1968 -0.1766 0.0963 0.0875 0.0952 0.0953 0.0990 0.0993 0.1037 0.0918 0.1270 0.1340 0.1247 0.1536
va: 1.2701 1.2454 1.0954 1.0953 1.0854 1.0853 2.1209 2.0540 3.7586 3.8067 3.9069 3.8907 3.9128 3.8893 4.1722 4.2167 3.8430 3.5558 3.9358 3.9183 3.9571 3.9621 3.8693 1.0331 1.0433 1.0210 1.0001 0.9998 1.0012 1.0000 1.0045 1.0207 0.9920 1.0143 0.9986
dispcorr: -0.017845985 hartree
energy: -2049.183329642552
dipole: -20.38005 19.94088 -0.43917 -24.91554 24.55185 -0.36369 -15.59084 14.22715 -1.36369
magnitude: 1.47810 au
magnitude: 3.75703 debye
