program: Orca
programVersion: 5.0.2
elementType: Cl Cl F F F F O O C C C C C C C C C C C C C C C H H H H H H H H H H H H
charge: 0
multiplicity: 1
keywords: wb97x-d3
keywords: def2-TZVPP
keywords: def2/J RIJCOSX
keywords: DEFGRID2
keywords: scfconv7
keywords: smallprint printgap noloewdin
keywords: NOSOSCF
formula: C15H12Cl2F4O2
InChI: InChI=1/C15H12Cl2F4O2/c1-15(2)7(3-10(16)17)11(15)14(22)23-5-6-12(20)8(18)4-9(19)13(6)21/h3-4,7,11H,5H2,1-2H3
35 atoms
Cl -5.46365 0.994261 1.032911
Cl -6.356434 0.151118 -1.5758
F  4.257165 2.538228 -1.043335
F  1.93294 -1.074383 0.90056
F  4.205894 -2.421722 1.094698
F  6.543627 1.183561 -0.789773
O  0.650203 0.763416 -0.613228
O  -0.370365 0.999718 1.371991
C  -1.868753 -1.592826 0.403574
C  -1.344182 -0.372763 -0.328866
C  -2.748735 -0.387374 0.245374
C  -1.398539 -1.932537 1.795997
C  -2.103187 -2.815639 -0.449629
C  -3.887523 -0.371644 -0.679459
C  -0.335445 0.52594 0.262207
C  -5.067816 0.182678 -0.432885
C  1.746829 1.582122 -0.221829
C  3.011401 0.774436 -0.104031
C  4.221937 1.31222 -0.516922
C  3.048514 -0.496778 0.449427
C  4.233064 -1.199466 0.564074
C  5.407817 0.614531 -0.386526
C  5.428164 -0.65383 0.150176
H  -1.26402 -0.492305 -1.403213
H  -2.872006 0.196276 1.150341
H  -1.31813 -1.06704 2.449077
H  -2.109856 -2.621115 2.255099
H  -0.429764 -2.433672 1.770214
H  -2.90571 -3.425296 -0.031314
H  -2.364816 -2.575198 -1.479126
H  -1.200984 -3.428569 -0.476869
H  -3.764082 -0.84825 -1.644674
H  1.545843 2.09863 0.717435
H  1.853962 2.33985 -0.995462
H  6.35567 -1.202505 0.248224
elementType: Cl F O C H
totalener: -2049.15427912 hartree
nucrepener: 2197.25592736 hartree
electener: -4246.41020648 hartree
oneelecener: -7190.82769254 hartree
twoeener: 2944.41748606 hartree
cpcmener: -0.02379405 hartree
kineticenergy: 2043.53304261 hartree
xcener: -143.165809418710 hartree
chargesum: 0.0000000
charge: -0.058309 -0.062117 -0.205263 -0.204892 -0.203785 -0.203847 -0.290067 -0.476245 0.093686 -0.075780 0.025506 -0.271169 -0.263828 -0.201167 0.403051 0.039969 0.087023 -0.090940 0.208266 0.220646 0.204073 0.203010 -0.171051 0.097373 0.078521 0.096253 0.101950 0.094007 0.100994 0.092582 0.098420 0.133432 0.121267 0.123065 0.155369
qa: -0.0583 -0.0621 -0.2053 -0.2049 -0.2038 -0.2038 -0.2901 -0.4762 0.0937 -0.0758 0.0255 -0.2712 -0.2638 -0.2012 0.4031 0.0400 0.0870 -0.0909 0.2083 0.2206 0.2041 0.2030 -0.1711 0.0974 0.0785 0.0963 0.1020 0.0940 0.1010 0.0926 0.0984 0.1334 0.1213 0.1231 0.1554
va: 1.2673 1.2431 1.0929 1.0906 1.0847 1.0844 2.1172 2.0248 3.7241 3.8406 3.8819 3.8970 3.9060 3.9017 4.1836 4.2072 3.8383 3.6136 3.9231 3.8560 3.9983 3.9610 3.8681 1.0336 1.0504 1.0174 1.0012 1.0072 1.0011 1.0054 1.0014 1.0170 1.0203 1.0051 0.9978
dispcorr: -0.016778911 hartree
energy: -2049.171058028119
dipole: -7.76163 8.83686 1.07523 -14.36741 13.41825 -0.94916 2.89126 -3.83709 -0.94583
magnitude: 1.71803 au
magnitude: 4.36688 debye
