program: Orca
programVersion: 5.0.2
elementType: Cl Cl F F F F O O C C C C C C C C C C C C C C C H H H H H H H H H H H H
charge: 0
multiplicity: 1
keywords: wb97x-d3
keywords: def2-TZVPP
keywords: def2/J RIJCOSX
keywords: DEFGRID2
keywords: scfconv7
keywords: smallprint printgap noloewdin
keywords: NOSOSCF
formula: C15H12Cl2F4O2
InChI: InChI=1/C15H12Cl2F4O2/c1-15(2)7(3-10(16)17)11(15)14(22)23-5-6-12(20)8(18)4-9(19)13(6)21/h3-4,7,11H,5H2,1-2H3
35 atoms
Cl -5.42221 1.013804 1.058085
Cl -6.377788 0.135889 -1.517736
F  4.286613 2.539484 -1.046452
F  1.889179 -1.093668 0.773867
F  4.158814 -2.396336 1.139988
F  6.5695 1.216597 -0.639568
O  0.647364 0.730941 -0.752519
O  -0.31136 1.017175 1.255574
C  -1.856166 -1.586894 0.402515
C  -1.338745 -0.394423 -0.381122
C  -2.729023 -0.379243 0.2270
C  -1.357324 -1.888965 1.793352
C  -2.1256 -2.833663 -0.405014
C  -3.89044 -0.381635 -0.669418
C  -0.311363 0.51639 0.156863
C  -5.065618 0.173557 -0.40168
C  1.749021 1.565263 -0.41743
C  3.003966 0.767488 -0.176604
C  4.234688 1.317617 -0.510263
C  3.021587 -0.496086 0.39484
C  4.207245 -1.179378 0.598244
C  5.418598 0.637831 -0.297509
C  5.420441 -0.623785 0.2572
H  -1.286349 -0.54938 -1.452491
H  -2.824394 0.234774 1.115293
H  -1.238937 -1.003586 2.41164
H  -2.072719 -2.54256 2.294181
H  -0.402559 -2.415392 1.760503
H  -1.232077 -3.458768 -0.434466
H  -2.924567 -3.418221 0.054032
H  -2.410979 -2.623389 -1.434749
H  -3.789591 -0.872682 -1.629819
H  1.527699 2.187785 0.450327
H  1.889276 2.227852 -1.269189
H  6.346203 -1.158792 0.422845
elementType: Cl F O C H
totalener: -2049.15390144 hartree
nucrepener: 2200.50511327 hartree
electener: -4249.65901471 hartree
oneelecener: -7197.35650955 hartree
twoeener: 2947.69749484 hartree
cpcmener: -0.02381910 hartree
kineticenergy: 2043.52546336 hartree
xcener: -143.164743578925 hartree
chargesum: -0.0000000
charge: -0.058328 -0.061992 -0.205720 -0.205340 -0.203835 -0.203835 -0.288615 -0.477206 0.095859 -0.080678 0.027284 -0.272576 -0.263380 -0.201363 0.400650 0.039395 0.091965 -0.098425 0.209510 0.225294 0.204198 0.199874 -0.169652 0.097275 0.078718 0.096639 0.102527 0.093610 0.098596 0.100976 0.092507 0.133865 0.121238 0.125599 0.155367
qa: -0.0583 -0.0620 -0.2057 -0.2053 -0.2038 -0.2038 -0.2886 -0.4772 0.0959 -0.0807 0.0273 -0.2726 -0.2634 -0.2014 0.4006 0.0394 0.0920 -0.0984 0.2095 0.2253 0.2042 0.1999 -0.1697 0.0973 0.0787 0.0966 0.1025 0.0936 0.0986 0.1010 0.0925 0.1339 0.1212 0.1256 0.1554
va: 1.2671 1.2431 1.0922 1.0895 1.0847 1.0845 2.1188 2.0214 3.7212 3.8457 3.8794 3.8964 3.9048 3.9018 4.1883 4.2067 3.8392 3.6190 3.9255 3.8436 4.0038 3.9626 3.8658 1.0335 1.0507 1.0176 1.0011 1.0076 1.0016 1.0011 1.0053 1.0166 1.0192 1.0026 0.9977
dispcorr: -0.016848772 hartree
energy: -2049.170750211378
dipole: -7.72241 8.75051 1.02810 -14.36514 13.40823 -0.95691 2.49073 -3.46375 -0.97302
magnitude: 1.70864 au
magnitude: 4.34302 debye
