program: Orca
programVersion: 5.0.2
elementType: Cl Cl F F F F O O C C C C C C C C C C C C C C C H H H H H H H H H H H H
charge: 0
multiplicity: 1
keywords: wb97x-d3
keywords: def2-TZVPP
keywords: def2/J RIJCOSX
keywords: DEFGRID2
keywords: scfconv7
keywords: smallprint printgap noloewdin
keywords: NOSOSCF
formula: C15H12Cl2F4O2
InChI: InChI=1/C15H12Cl2F4O2/c1-15(2)7(3-10(16)17)11(15)14(22)23-5-6-12(20)8(18)4-9(19)13(6)21/h3-4,7,11H,5H2,1-2H3
35 atoms
Cl -2.805955 1.085505 2.394028
Cl -4.546086 2.629377 0.689091
F  1.33288 1.659885 -1.127371
F  4.087297 -2.12328 -0.625357
F  5.166128 -1.040104 1.561305
F  2.371414 2.70306 1.099039
O  0.6319 -0.769255 -2.210323
O  0.420276 -1.923874 -0.31048
C  -2.634227 -1.934734 -0.970669
C  -1.516687 -1.011905 -1.400545
C  -2.354821 -0.700319 -0.165916
C  -2.354941 -3.267937 -0.321813
C  -3.829478 -1.976735 -1.892956
C  -3.233783 0.473033 -0.199966
C  -0.084272 -1.310372 -1.221702
C  -3.487538 1.27665 0.825049
C  2.050349 -0.896532 -2.160149
C  2.660215 -0.275473 -0.932749
C  2.265543 0.970011 -0.469425
C  3.651723 -0.929355 -0.219235
C  4.213306 -0.370052 0.913112
C  2.809778 1.516975 0.677047
C  3.79366 0.856136 1.380671
H  -1.737322 -0.409867 -2.274262
H  -1.85013 -0.885332 0.775611
H  -3.267918 -3.629167 0.154963
H  -2.057754 -4.008331 -1.066358
H  -1.583653 -3.224633 0.442608
H  -3.988271 -1.045259 -2.434879
H  -3.698216 -2.764989 -2.635841
H  -4.737977 -2.198542 -1.330649
H  -3.719998 0.714949 -1.13733
H  2.40697 -0.388239 -3.055199
H  2.334065 -1.945246 -2.244421
H  4.225744 1.289056 2.273429
elementType: Cl F O C H
totalener: -2049.15427128 hartree
nucrepener: 2275.62845879 hartree
electener: -4324.78273007 hartree
oneelecener: -7348.24204285 hartree
twoeener: 3023.45931278 hartree
cpcmener: -0.02509460 hartree
kineticenergy: 2043.54569771 hartree
xcener: -143.167887574801 hartree
chargesum: -0.0000000
charge: -0.057339 -0.061748 -0.202973 -0.204851 -0.204596 -0.204384 -0.286740 -0.482316 0.097352 -0.069292 0.021155 -0.271996 -0.270004 -0.197621 0.412926 0.040436 0.074936 -0.106933 0.202662 0.233359 0.200194 0.195636 -0.175269 0.096789 0.083443 0.097369 0.100848 0.093233 0.093320 0.099109 0.100953 0.131390 0.137399 0.126785 0.156770
qa: -0.0573 -0.0617 -0.2030 -0.2049 -0.2046 -0.2044 -0.2867 -0.4823 0.0974 -0.0693 0.0212 -0.2720 -0.2700 -0.1976 0.4129 0.0404 0.0749 -0.1069 0.2027 0.2334 0.2002 0.1956 -0.1753 0.0968 0.0834 0.0974 0.1008 0.0932 0.0933 0.0991 0.1010 0.1314 0.1374 0.1268 0.1568
va: 1.2685 1.2432 1.0937 1.0934 1.0829 1.0844 2.1236 2.0197 3.7324 3.8442 3.8852 3.8957 3.9108 3.8998 4.1259 4.2082 3.8327 3.5513 3.9381 3.9073 3.9538 3.9617 3.8662 1.0341 1.0445 0.9996 0.9994 1.0209 1.0053 1.0008 1.0010 1.0186 0.9916 1.0144 0.9973
dispcorr: -0.017144378 hartree
energy: -2049.171415659552
dipole: -18.80882 18.56116 -0.24765 -23.51212 23.16900 -0.34312 -16.76876 15.15846 -1.61030
magnitude: 1.66497 au
magnitude: 4.23201 debye
