program: Orca
programVersion: 5.0.2
elementType: Cl Cl F F F F O O C C C C C C C C C C C C C C C H H H H H H H H H H H H
charge: 0
multiplicity: 1
keywords: wb97x-d3
keywords: def2-TZVPP
keywords: def2/J RIJCOSX
keywords: DEFGRID2
keywords: scfconv7
keywords: smallprint printgap noloewdin
keywords: NOSOSCF
formula: C15H12Cl2F4O2
InChI: InChI=1/C15H12Cl2F4O2/c1-15(2)7(3-10(16)17)11(15)14(22)23-5-6-12(20)8(18)4-9(19)13(6)21/h3-4,7,11H,5H2,1-2H3
35 atoms
Cl -4.730977 1.394492 1.207208
Cl -6.248019 0.752781 -1.159505
F  3.19282 2.476164 -0.754828
F  2.311603 -1.388907 1.77797
F  4.694063 -2.387852 1.066945
F  5.570711 1.487912 -1.436811
O  0.250823 0.321824 0.634367
O  0.623153 0.644958 -1.540083
C  -1.806504 -1.777354 -0.091232
C  -1.261406 -0.62661 -0.907584
C  -2.513819 -0.454143 -0.053494
C  -1.146717 -2.258399 1.179093
C  -2.38844 -2.914507 -0.898461
C  -3.790389 -0.22288 -0.738059
C  -0.042901 0.164104 -0.65109
C  -4.780052 0.536195 -0.284458
C  1.364827 1.145649 0.974482
C  2.682816 0.573175 0.536646
C  3.541933 1.275693 -0.292251
C  3.102428 -0.672284 0.977719
C  4.331401 -1.18807 0.612938
C  4.775806 0.764179 -0.648032
C  5.183955 -0.474408 -0.202814
H  -1.448694 -0.712521 -1.971829
H  -2.367422 0.104837 0.863148
H  -0.237871 -2.821267 0.960781
H  -0.899898 -1.460406 1.873643
H  -1.832243 -2.932886 1.694939
H  -3.187886 -3.407091 -0.342545
H  -2.791671 -2.597536 -1.859222
H  -1.61708 -3.659579 -1.099232
H  -3.945614 -0.700732 -1.698007
H  1.333613 1.217271 2.060247
H  1.221629 2.149753 0.578152
H  6.148729 -0.876588 -0.484027
elementType: Cl F O C H
totalener: -2049.15362542 hartree
nucrepener: 2230.27570879 hartree
electener: -4279.42933421 hartree
oneelecener: -7256.91745995 hartree
twoeener: 2977.48812574 hartree
cpcmener: -0.02663783 hartree
kineticenergy: 2043.54365434 hartree
xcener: -143.167192660154 hartree
chargesum: 0.0000000
charge: -0.058270 -0.061631 -0.205328 -0.204238 -0.204380 -0.204775 -0.274085 -0.488610 0.114614 -0.116380 0.033394 -0.276550 -0.270552 -0.209345 0.452275 0.041126 0.047547 -0.121047 0.253774 0.214359 0.193066 0.198642 -0.173356 0.093898 0.090364 0.098661 0.091640 0.098487 0.099643 0.093523 0.099532 0.132261 0.137719 0.127713 0.156311
qa: -0.0583 -0.0616 -0.2053 -0.2042 -0.2044 -0.2048 -0.2741 -0.4886 0.1146 -0.1164 0.0334 -0.2765 -0.2706 -0.2093 0.4523 0.0411 0.0475 -0.1210 0.2538 0.2144 0.1931 0.1986 -0.1734 0.0939 0.0904 0.0987 0.0916 0.0985 0.0996 0.0935 0.0995 0.1323 0.1377 0.1277 0.1563
va: 1.2677 1.2439 1.0919 1.0941 1.0843 1.0835 2.1232 2.0211 3.6844 3.8522 3.8615 3.8979 3.9153 3.8966 4.1447 4.2109 3.8417 3.5588 3.8764 3.9065 3.9740 3.9561 3.8716 1.0318 1.0381 1.0040 1.0148 1.0012 1.0010 1.0057 1.0002 1.0190 0.9947 1.0146 0.9975
dispcorr: -0.017570484 hartree
energy: -2049.171195902268
dipole: -8.91405 9.15278 0.23873 -17.84297 16.77041 -1.07256 -0.06769 0.93630 0.86861
magnitude: 1.40067 au
magnitude: 3.56022 debye
