program: Orca
programVersion: 5.0.2
elementType: Cl Cl F F F F O O C C C C C C C C C C C C C C C H H H H H H H H H H H H
charge: 0
multiplicity: 1
keywords: wb97x-d3
keywords: def2-TZVPP
keywords: def2/J RIJCOSX
keywords: DEFGRID2
keywords: scfconv7
keywords: smallprint printgap noloewdin
keywords: NOSOSCF
formula: C15H12Cl2F4O2
InChI: InChI=1/C15H12Cl2F4O2/c1-15(2)7(3-10(16)17)11(15)14(22)23-5-6-12(20)8(18)4-9(19)13(6)21/h3-4,7,11H,5H2,1-2H3
35 atoms
Cl -2.57259 1.830954 1.73683
Cl -4.250548 2.920563 -0.341856
F  0.99627 0.699636 1.622228
F  3.884098 -2.102688 -0.821201
F  5.371617 0.008634 -1.478165
F  2.466532 2.818084 0.919475
O  0.189033 -1.740222 0.454187
O  0.715438 -1.950039 -1.70303
C  -2.719858 -2.091926 -0.598498
C  -1.505516 -1.365875 -1.139157
C  -2.410135 -0.706997 -0.109851
C  -2.568708 -3.231654 0.378292
C  -3.837511 -2.315106 -1.588586
C  -3.188332 0.469589 -0.511492
C  -0.103338 -1.720286 -0.842401
C  -3.315283 1.580779 0.203157
C  1.55084 -1.938424 0.829099
C  2.399134 -0.764704 0.428849
C  2.070047 0.514352 0.852417
C  3.520617 -0.900739 -0.372616
C  4.290086 0.194164 -0.719611
C  2.829764 1.608855 0.49117
C  3.952337 1.460969 -0.296915
H  -1.61641 -1.020463 -2.160953
H  -2.004114 -0.667762 0.893453
H  -1.858163 -3.027635 1.175581
H  -3.53208 -3.436685 0.847711
H  -2.253633 -4.141098 -0.135709
H  -4.79999 -2.359726 -1.076003
H  -3.896129 -1.538686 -2.35047
H  -3.692724 -3.265137 -2.105248
H  -3.693221 0.447655 -1.469571
H  1.936019 -2.870635 0.418982
H  1.532162 -2.039723 1.912848
H  4.553547 2.316716 -0.574821
elementType: Cl F O C H
totalener: -2049.15409385 hartree
nucrepener: 2297.96024032 hartree
electener: -4347.11433416 hartree
oneelecener: -7392.65834307 hartree
twoeener: 3045.54400891 hartree
cpcmener: -0.02708006 hartree
kineticenergy: 2043.54917079 hartree
xcener: -143.168136296097 hartree
chargesum: -0.0000000
charge: -0.059438 -0.062510 -0.202958 -0.204737 -0.204890 -0.204199 -0.276082 -0.482626 0.081303 -0.080854 0.036120 -0.261043 -0.278525 -0.206050 0.433727 0.045195 0.050554 -0.135120 0.218458 0.259226 0.195558 0.189390 -0.169251 0.100480 0.081138 0.093725 0.097201 0.101657 0.101993 0.093669 0.098897 0.130388 0.125048 0.137864 0.156691
qa: -0.0594 -0.0625 -0.2030 -0.2047 -0.2049 -0.2042 -0.2761 -0.4826 0.0813 -0.0809 0.0361 -0.2610 -0.2785 -0.2060 0.4337 0.0452 0.0506 -0.1351 0.2185 0.2592 0.1956 0.1894 -0.1693 0.1005 0.0811 0.0937 0.0972 0.1017 0.1020 0.0937 0.0989 0.1304 0.1250 0.1379 0.1567
va: 1.2672 1.2428 1.0950 1.0927 1.0834 1.0847 2.1212 2.0266 3.7806 3.8107 3.8275 3.8987 3.9137 3.8923 4.1495 4.2114 3.8486 3.5915 3.9174 3.8799 3.9589 3.9661 3.8656 1.0276 1.0451 1.0136 0.9999 0.9999 1.0000 1.0054 1.0007 1.0208 1.0151 0.9959 0.9975
dispcorr: -0.017884117 hartree
energy: -2049.171977965388
dipole: -20.82579 20.21874 -0.60705 -28.07287 27.15911 -0.91376 -6.36700 6.91305 0.54605
magnitude: 1.22541 au
magnitude: 3.11475 debye
