program: Orca
programVersion: 5.0.2
elementType: Cl Cl F F F F O O C C C C C C C C C C C C C C C H H H H H H H H H H H H
charge: 0
multiplicity: 1
keywords: wb97x-d3
keywords: def2-TZVPP
keywords: def2/J RIJCOSX
keywords: DEFGRID2
keywords: scfconv7
keywords: smallprint printgap noloewdin
keywords: NOSOSCF
formula: C15H12Cl2F4O2
InChI: InChI=1/C15H12Cl2F4O2/c1-15(2)7(3-10(16)17)11(15)14(22)23-5-6-12(20)8(18)4-9(19)13(6)21/h3-4,7,11H,5H2,1-2H3
35 atoms
Cl -1.357675 0.230016 1.689517
Cl -3.980608 -0.412552 2.713002
F  3.519659 1.743408 -1.655005
F  1.175309 -1.723623 0.497786
F  2.119425 -0.891905 2.855483
F  4.5455 2.493756 0.692163
O  0.354787 -0.619146 -1.935071
O  0.112414 1.596945 -1.871869
C  -2.695729 -0.733955 -2.345426
C  -1.806075 0.243054 -1.589003
C  -2.293931 -1.037724 -0.944194
C  -2.154088 -1.588384 -3.464855
C  -4.096712 -0.234332 -2.603177
C  -3.235511 -0.965232 0.194273
C  -0.372592 0.488907 -1.822125
C  -2.904936 -0.453921 1.371397
C  1.773022 -0.489902 -1.969538
C  2.315984 -0.014771 -0.650644
C  3.173277 1.068627 -0.558338
C  1.984195 -0.665151 0.529342
C  2.479813 -0.243613 1.747794
C  3.696582 1.466999 0.658473
C  3.350101 0.822942 1.82561
H  -2.315318 1.149227 -1.281317
H  -1.540707 -1.813213 -0.837295
H  -2.021113 -1.000594 -4.374466
H  -1.206408 -2.064355 -3.226137
H  -2.867738 -2.382785 -3.689539
H  -4.135743 0.331275 -3.535274
H  -4.788554 -1.073446 -2.695786
H  -4.46255 0.414505 -1.807006
H  -4.229989 -1.381326 0.079689
H  2.085452 0.158511 -2.786564
H  2.141478 -1.491066 -2.187405
H  3.750984 1.144629 2.778116
elementType: Cl F O C H
totalener: -2049.15150342 hartree
nucrepener: 2371.09448533 hartree
electener: -4420.24598875 hartree
oneelecener: -7539.22888830 hartree
twoeener: 3118.98289956 hartree
cpcmener: -0.02646361 hartree
kineticenergy: 2043.56493775 hartree
xcener: -143.170601665810 hartree
chargesum: -0.0000000
charge: -0.058281 -0.058013 -0.204345 -0.197879 -0.203963 -0.204242 -0.271494 -0.483413 0.140331 -0.133043 -0.007751 -0.271460 -0.283247 -0.247962 0.409548 0.095766 0.057817 -0.098333 0.254029 0.151141 0.210568 0.195811 -0.165526 0.112387 0.113514 0.102280 0.094271 0.095293 0.100444 0.102246 0.093894 0.142402 0.125856 0.135342 0.156012
qa: -0.0583 -0.0580 -0.2043 -0.1979 -0.2040 -0.2042 -0.2715 -0.4834 0.1403 -0.1330 -0.0078 -0.2715 -0.2832 -0.2480 0.4095 0.0958 0.0578 -0.0983 0.2540 0.1511 0.2106 0.1958 -0.1655 0.1124 0.1135 0.1023 0.0943 0.0953 0.1004 0.1022 0.0939 0.1424 0.1259 0.1353 0.1560
va: 1.2831 1.2485 1.0941 1.0935 1.0831 1.0836 2.1087 2.0201 3.7199 3.8597 3.8252 3.8958 3.9178 3.9160 4.1215 4.1634 3.8442 3.5385 3.9026 3.9233 3.9370 3.9538 3.8713 1.0218 1.0224 0.9992 1.0129 1.0008 1.0021 0.9994 0.9996 1.0086 1.0155 0.9965 0.9973
dispcorr: -0.019979865 hartree
energy: -2049.171483286930
dipole: -21.79622 21.23909 -0.55713 -8.80727 7.14416 -1.66311 -30.30342 29.37014 -0.93327
magnitude: 1.98679 au
magnitude: 5.05002 debye
