program: Orca
programVersion: 5.0.2
elementType: Cl Cl F F F F O O C C C C C C C C C C C C C C C H H H H H H H H H H H H
charge: 0
multiplicity: 1
keywords: wb97x-d3
keywords: def2-TZVPP
keywords: def2/J RIJCOSX
keywords: DEFGRID2
keywords: scfconv7
keywords: smallprint printgap noloewdin
keywords: NOSOSCF
formula: C15H12Cl2F4O2
InChI: InChI=1/C15H12Cl2F4O2/c1-15(2)7(3-10(16)17)11(15)14(22)23-5-6-12(20)8(18)4-9(19)13(6)21/h3-4,7,11H,5H2,1-2H3
35 atoms
Cl -1.34495 1.839955 -0.024889
Cl -4.061369 2.824993 0.01039
F  1.104089 0.496456 2.02774
F  3.611531 -1.861254 -1.18387
F  4.93001 0.369266 -1.788634
F  2.40061 2.741106 1.383825
O  0.154269 -1.807471 0.617672
O  0.425288 -1.753346 -1.595999
C  -2.846794 -2.247332 -0.161206
C  -1.735299 -1.36767 -0.717012
C  -2.552418 -0.932297 0.476571
C  -2.523259 -3.513094 0.591392
C  -4.065495 -2.370958 -1.042505
C  -3.45671 0.231086 0.34345
C  -0.294389 -1.666833 -0.626884
C  -3.016895 1.464194 0.138281
C  1.556302 -1.993431 0.804956
C  2.318796 -0.750538 0.44456
C  2.038687 0.451047 1.078133
C  3.301739 -0.741284 -0.530702
C  3.985466 0.417498 -0.848615
C  2.711578 1.61082 0.748927
C  3.696292 1.607367 -0.217017
H  -1.98088 -0.89609 -1.662091
H  -2.041997 -0.983774 1.434158
H  -3.399073 -3.837215 1.155909
H  -2.261769 -4.316806 -0.098774
H  -1.706514 -3.396548 1.300263
H  -3.941116 -3.186358 -1.756529
H  -4.949511 -2.589757 -0.440746
H  -4.264542 -1.461933 -1.610723
H  -4.52546 0.079775 0.446729
H  1.911659 -2.85835 0.246905
H  1.671806 -2.217438 1.863944
H  4.228224 2.515239 -0.470689
elementType: Cl F O C H
totalener: -2049.15223844 hartree
nucrepener: 2353.77673949 hartree
electener: -4402.92897793 hartree
oneelecener: -7504.60635642 hartree
twoeener: 3101.67737849 hartree
cpcmener: -0.02672323 hartree
kineticenergy: 2043.56123249 hartree
xcener: -143.169381556295 hartree
chargesum: 0.0000000
charge: -0.059353 -0.058666 -0.201151 -0.205163 -0.204918 -0.204950 -0.270423 -0.484259 0.129460 -0.154987 0.005626 -0.269447 -0.283919 -0.245299 0.430472 0.089812 0.051849 -0.116529 0.171407 0.263650 0.195520 0.209537 -0.166697 0.116184 0.112628 0.096540 0.102136 0.093899 0.099833 0.102145 0.094205 0.142313 0.125258 0.137387 0.155900
qa: -0.0594 -0.0587 -0.2012 -0.2052 -0.2049 -0.2050 -0.2704 -0.4843 0.1295 -0.1550 0.0056 -0.2694 -0.2839 -0.2453 0.4305 0.0898 0.0518 -0.1165 0.1714 0.2636 0.1955 0.2095 -0.1667 0.1162 0.1126 0.0965 0.1021 0.0939 0.0998 0.1021 0.0942 0.1423 0.1253 0.1374 0.1559
va: 1.2822 1.2479 1.0927 1.0927 1.0834 1.0832 2.1122 2.0226 3.7350 3.8555 3.8201 3.8952 3.9143 3.9083 4.1135 4.1690 3.8423 3.5675 3.9166 3.8814 3.9564 3.9493 3.8684 1.0212 1.0216 1.0014 0.9992 1.0129 1.0024 0.9995 0.9992 1.0078 1.0153 0.9965 0.9975
dispcorr: -0.019531183 hartree
energy: -2049.171769620118
dipole: -24.03151 23.12172 -0.90978 -29.65627 28.61968 -1.03658 0.00267 1.25473 1.25740
magnitude: 1.86635 au
magnitude: 4.74389 debye
